{"text_format":"1","workbook":"xlsx","n_sheets":9,"sheets":["Deckblatt","Turnierprotokoll","Einzelwertung","Kategoriewertung","Mannschaften","Startliste","Konstanten","players","Kurznamen"],"not_rendered":{"charts":0,"images":1,"macros":1,"external_links":0,"defined_names":29,"comments":0,"pivot_tables":0},"unopened":[],"bounds":{"document_bytes":16777216,"sheet_cells":100000,"rows_first":2000,"rows_last":500,"rows_between":2000,"halvings":0,"cell_chars":16384,"cell_head_chars":4096},"cells_cut":0,"cells_raw":0,"read":"whole","date_system":"1900"}

{"sheet":"Deckblatt","index":0,"n_rows":52,"n_cols":16,"rows_kept":52,"cut":false,"hidden":false,"merged":[[7,15,7,17],[50,0,50,3],[38,2,38,4],[38,5,38,10],[39,2,39,4],[39,5,39,10],[40,2,40,4],[40,5,40,10],[37,2,37,4],[37,5,37,10],[41,2,41,4],[41,5,41,10],[47,0,47,3],[34,2,34,4],[34,5,34,10],[35,2,35,4],[35,5,35,10],[36,2,36,4],[36,5,36,10],[31,5,31,10],[32,2,32,4],[32,5,32,10],[33,2,33,4],[33,5,33,10],[9,3,9,5],[9,6,9,9],[9,12,9,13],[12,0,12,13],[13,0,13,13],[9,10,9,11],[7,3,7,5],[7,6,7,9],[7,12,7,13],[8,3,8,5],[8,6,8,9],[8,12,8,13],[7,10,7,11],[8,10,8,11],[0,0,0,13],[1,0,1,13],[2,0,2,13],[3,0,3,13],[5,3,5,5],[5,6,5,9],[5,12,5,13],[5,10,5,11],[4,10,4,11],[4,12,4,13],[32,0,32,1],[33,0,33,1],[34,0,34,1],[35,0,35,1],[36,0,36,1],[37,0,37,1],[38,0,38,1],[39,0,39,1],[40,0,40,1],[41,0,41,1]]}
[{"$f":"IF(Ligawahl<10,\"Minigolfsport-Verband Bremen/Niedersachsen e.V.\",\"Deutscher Minigolfsport Verband e. V.\")","v":"Minigolfsport-Verband Bremen/Niedersachsen e.V."}]
["Ergebnisliste"]
[{"$f":"Spieltagwahl&\". Spieltag  -  \"&VLOOKUP(Ligawahl,Teamgröße,2,0)&\"  -  Saison 2022\"","v":"1. Spieltag  -  Bezirksklasse Nord  -  Saison 2022"}]
[{"$f":"\"am \"&TEXT(P7,\"TT.MM.JJJJ\")&\" in \"&P8","v":"am 00.01.1900 in "}]
[null,null,null,"Name, Vorname",null,null,"Verein",null,null,null,"Spieler-Nr.",null,"Lizenz-Nr."]
["A. Turnierleitung:",null,null,{"$f":"IF(K6=\"\",\"\",IF(ISERROR(VLOOKUP(K6,Spieler,4,0)),\"Falsche Nummer!\",VLOOKUP(K6,Spieler,4,0)&\", \"&VLOOKUP(K6,Spieler,3,0)))","v":""},null,null,{"$f":"IF(ISERROR(VLOOKUP(K6,Spieler,5,0)),\"\",VLOOKUP(K6,Spieler,5,0))","v":""},null,null,null,null,null,{"$f":"IF(ISERROR(VLOOKUP(K6,Spieler,7,0)),\"\",VLOOKUP(K6,Spieler,7,0))","v":""}]
[null,null,null,null,null,null,null,null,null,null,null,null,null,null,"Datum:"]
["B. Schiedsgericht:",null,"OSR:",{"$f":"IF(K8=\"\",\"\",IF(ISERROR(VLOOKUP(K8,Spieler,4,0)),\"Falsche Nummer!\",VLOOKUP(K8,Spieler,4,0)&\", \"&VLOOKUP(K8,Spieler,3,0)))","v":""},null,null,{"$f":"IF(ISERROR(VLOOKUP(K8,Spieler,5,0)),\"\",VLOOKUP(K8,Spieler,5,0))","v":""},null,null,null,null,null,{"$f":"IF(ISERROR(VLOOKUP(K8,Spieler,7,0)),\"\",VLOOKUP(K8,Spieler,7,0))","v":""},null,"Ort:"]
[null,null,"SR:",{"$f":"IF(K9=\"\",\"\",IF(ISERROR(VLOOKUP(K9,Spieler,4,0)),\"Falsche Nummer!\",VLOOKUP(K9,Spieler,4,0)&\", \"&VLOOKUP(K9,Spieler,3,0)))","v":""},null,null,{"$f":"IF(ISERROR(VLOOKUP(K9,Spieler,5,0)),\"\",VLOOKUP(K9,Spieler,5,0))","v":""},null,null,null,null,null,{"$f":"IF(ISERROR(VLOOKUP(K9,Spieler,7,0)),\"\",VLOOKUP(K9,Spieler,7,0))","v":""},null,"System:","Miniaturgolf"]
[null,null,"SR:",{"$f":"IF(K10=\"\",\"\",IF(ISERROR(VLOOKUP(K10,Spieler,4,0)),\"Falsche Nummer!\",VLOOKUP(K10,Spieler,4,0)&\", \"&VLOOKUP(K10,Spieler,3,0)))","v":""},null,null,{"$f":"IF(ISERROR(VLOOKUP(K10,Spieler,5,0)),\"\",VLOOKUP(K10,Spieler,5,0))","v":""},null,null,null,null,null,{"$f":"IF(ISERROR(VLOOKUP(K10,Spieler,7,0)),\"\",VLOOKUP(K10,Spieler,7,0))","v":""}]
[]
["C. Besondere Vorkommnisse:"]
["keine"]
[]
[]
["D. Mannschaftswertung vor dem Spieltag:",null,null,null,null,null,null,null,null,null,null,null,null,null,5]
[null,null,null,null,null,null,"Ort1","Ort2","Ort3","Ort4","Ort5","Ges.","ø","Punkte",1]
[null,null,null,null,null,"gespielte Runden:"]
[1,null,null,null,null,null,null,null,null,null,null,{"$f":"SUM(G19:K19)","v":0},{"$f":"IF(L19<>0,L19/(SUM($G$18:$K$18)*(AnzSp-2)),0)","v":0}]
[]
["E. Mannschaftswertung des Spieltages:"]
[null,null,null,null,null,null,null,"R1","R2","R3","R4","Ges.","ø","Punkte"]
[1,{"$f":"IF(INDIRECT(\"Mannschaften!Z\"&A23*(AnzSp+4)-AnzSp&\"S\"&COLUMN(),0)=\"\",\"\",INDIRECT(\"Mannschaften!Z\"&A23*(AnzSp+4)-AnzSp&\"S\"&COLUMN(),0))","v":""},null,null,null,null,null,{"$f":"IF(INDIRECT(\"Mannschaften!Z\"&$A23*(AnzSp+4)+2&\"S\"&COLUMN()-1,0)=0,\"\",INDIRECT(\"Mannschaften!Z\"&$A23*(AnzSp+4)+2&\"S\"&COLUMN()-1,0))","v":""},"","","",{"$f":"SUM(H23:K23)","v":0},{"$f":"IF(L23<>0,L23/(COUNT(H23:K23)*(AnzSp-2)),0)","v":0}]
[]
["F. Mannschaftswertung nach dem Spieltag:"]
[null,null,null,null,null,null,{"$f":"G17","v":"Ort1"},{"$f":"H17","v":"Ort2"},{"$f":"I17","v":"Ort3"},{"$f":"J17","v":"Ort4"},{"$f":"K17","v":"Ort5"},"Ges.","ø","Punkte"]
[null,null,null,null,null,"gespielte Runden:",{"$f":"IF(G19<>\"\",G18,IF(AnzahlRd>0,AnzahlRd,\"\"))","v":""},{"$f":"IF(H19<>\"\",H18,IF(G19<>\"\",AnzahlRd,\"\"))","v":""},{"$f":"IF(I19<>\"\",I18,IF(H19<>\"\",AnzahlRd,\"\"))","v":""},{"$f":"IF(J19<>\"\",J18,IF(I19<>\"\",AnzahlRd,\"\"))","v":""},{"$f":"IF(K19<>\"\",K18,IF(J19<>\"\",AnzahlRd,\"\"))","v":""}]
[1,null,null,null,null,null,{"$f":"IF(ISERROR(VLOOKUP($B28,Teams,COLUMN()-1,0)),\"\",IF(AND(VLOOKUP($B28,Teams,COLUMN()-1,0)=\"\",OR(VLOOKUP($B28,Teams,COLUMN()-2,0)<>\"\",F$26=\"\")),VLOOKUP($B28,Teams2,11,0),VLOOKUP($B28,Teams,COLUMN()-1,0)))","v":""},"","","","",{"$f":"SUM(G28:K28)","v":0},{"$f":"IF(L28<>0,L28/(SUM($G$27:$K$27)*(AnzSp-2)),0)","v":0},{"$f":"IF(ISERROR(VLOOKUP(B28,Teams,COLUMN()-1,0)),\"\",VLOOKUP(B28,Teams,13,0)+VLOOKUP(B28,Teams2,13,0))","v":""}]
[]
["G. Beste Durchgänge:"]
["Kategorie",null,"Name",null,null,"Verein",null,null,null,null,null,"Erg."]
[{"$f":"(AnzSp-2)&\"er-Mannschaften\"","v":"3er-Mannschaften"}]
["Damen:"]
["Herren: "]
["Seniorinnen I:"]
["Senioren I:"]
["Seniorinnen II:"]
["Senioren II:"]
["Jugend weiblich:"]
["Jugend männlich:"]
["Schülerinnen:"]
["Schüler:"]
[]
["H. Zeichenerklärungen:",null,null,null,"BR ","Bahnrekord"]
[null,null,null,null,"BRE","Bahnrekord eingestellt"]
[]
[]
["Austragungsort, xx.xx.xxxx"]
["Für die Richtigkeit"]
[]
[{"$f":"IF(D6<>\"\",MID(D6,FIND(\",\",D6)+2,99)&\" \"&LEFT(D6,FIND(\",\",D6)-1),\"\")","v":""}]
["(Turnierleitung)"]

{"sheet":"Turnierprotokoll","index":1,"n_rows":27,"n_cols":7,"rows_kept":27,"cut":false,"hidden":false,"merged":[[18,0,18,2],[18,4,18,6],[1,0,1,6],[3,1,3,6],[4,1,4,6],[5,3,5,6],[6,1,6,6],[9,1,9,4],[11,1,11,4],[12,1,12,4],[13,1,13,4],[16,0,16,2],[16,4,16,6],[20,0,20,2],[20,4,20,6],[22,0,22,6],[24,1,24,5],[26,4,26,6]]}
[]
["Turnierprotokoll"]
[]
["Turnier:",{"$f":"Deckblatt!A3","v":"1. Spieltag  -  Bezirksklasse Nord  -  Saison 2022"}]
["Veranstalter:",{"$f":"Deckblatt!A1","v":"Minigolfsport-Verband Bremen/Niedersachsen e.V."}]
["Datum:",{"$f":"Deckblatt!P7","v":"00:00:00"},"Ort:",{"$f":"Deckblatt!P8","v":0}]
["System(e):",{"$f":"Deckblatt!P9","v":"Miniaturgolf"}]
[]
[null,"Name, Vorname",null,null,null,"Verein","Lizenz-Nr."]
["Turnierleiter:",{"$f":"IF(Deckblatt!D6=0,\"\",Deckblatt!D6)","v":""},null,null,null,{"$f":"IF(Deckblatt!G6=0,\"\",Deckblatt!G6)","v":""},{"$f":"IF(Deckblatt!M6=0,\"\",Deckblatt!M6)","v":""}]
[]
["Oberschiedsrichter:",{"$f":"IF(Deckblatt!D8=0,\"\",Deckblatt!D8)","v":""},null,null,null,{"$f":"IF(Deckblatt!G8=0,\"\",Deckblatt!G8)","v":""},{"$f":"IF(Deckblatt!M8=0,\"\",Deckblatt!M8)","v":""}]
["Schiedsrichter:",{"$f":"IF(Deckblatt!D9=0,\"\",Deckblatt!D9)","v":""},null,null,null,{"$f":"IF(Deckblatt!G9=0,\"\",Deckblatt!G9)","v":""},{"$f":"IF(Deckblatt!M9=0,\"\",Deckblatt!M9)","v":""}]
["Schiedsrichter:",{"$f":"IF(Deckblatt!D10=0,\"\",Deckblatt!D10)","v":""},null,null,null,{"$f":"IF(Deckblatt!G10=0,\"\",Deckblatt!G10)","v":""},{"$f":"IF(Deckblatt!M10=0,\"\",Deckblatt!M10)","v":""}]
[]
["Auswechselungen:",null,null,null,"Strafen:"]
["Entfällt"]
["Besondere Vorkommnisse:",null,null,null,"Besonderheiten, Beschädigungen oder Fehler an den Bahnen:"]
[{"$f":"Deckblatt!A13&\", \"&Deckblatt!A14","v":"keine, "}]
["Ausnahmen für Spieler/innen:",null,null,null,"Ausnahmen DMV-Sportordnung/int. Spielregeln:"]
[]
["Proteste, Entscheidung Jury (bei Bedarf ist ein Extrablatt zu fertigen):"]
[]
[]
["Oberschiedsrichter:"]
[]
["Datum:",null,null,"Turnierleiter:"]

{"sheet":"Einzelwertung","index":2,"n_rows":59,"n_cols":14,"rows_kept":59,"cut":false,"hidden":false,"merged":[]}
[]
["I. Einzelwertung"]
["Pl.","Nachname","Vorname","Verein","Sp.Nr.","Kat.","R1","R2","R3","R4","Ges.","ø","Diff."]
[1,{"$f":"IF(E4=\"\",\"\",IF(ISERROR(VLOOKUP(E4,Spieler,4,0)),\"Falsche Nummer!\",VLOOKUP(E4,Spieler,4,0)))","v":""},{"$f":"IF(ISERROR(VLOOKUP(E4,Spieler,3,0)),\"\",VLOOKUP(E4,Spieler,3,0))","v":""},{"$f":"IF(ISERROR(VLOOKUP(E4,Spieler,5,0)),\"\",VLOOKUP(E4,Spieler,5,0))","v":""},null,{"$f":"IF(ISERROR(VLOOKUP(E4,Spieler,2,0)),\"\",VLOOKUP(E4,Spieler,2,0))","v":""},null,null,null,null,{"$f":"IF(COUNT(G4:J4)>0,SUM(G4:J4),\"\")","v":""},{"$f":"IF(K4<>\"\",K4/COUNT(G4:J4),\"\")","v":""},{"$f":"IF(COUNT(G4:J4)>1,LARGE(G4:J4,1)-SMALL(G4:J4,1),\"\")","v":""},{"$f":"IF(F4<>\"\",VLOOKUP(F4,Kategorieliste,2,0),\"\")","v":""}]
[{"$f":"IF(B5<>\"\",A4+1,\"\")","v":""},{"$f":"IF(E5=\"\",\"\",IF(ISERROR(VLOOKUP(E5,Spieler,4,0)),\"Falsche Nummer!\",VLOOKUP(E5,Spieler,4,0)))","v":""},{"$f":"IF(ISERROR(VLOOKUP(E5,Spieler,3,0)),\"\",VLOOKUP(E5,Spieler,3,0))","v":""},"",null,"",null,null,null,null,{"$f":"IF(COUNT(G5:J5)>0,SUM(G5:J5),\"\")","v":""},{"$f":"IF(K5<>\"\",K5/COUNT(G5:J5),\"\")","v":""},{"$f":"IF(COUNT(G5:J5)>1,LARGE(G5:J5,1)-SMALL(G5:J5,1),\"\")","v":""},{"$f":"IF(F5<>\"\",VLOOKUP(F5,Kategorieliste,2,0),\"\")","v":""}]
[{"$f":"IF(B6<>\"\",A5+1,\"\")","v":""},{"$f":"IF(E6=\"\",\"\",IF(ISERROR(VLOOKUP(E6,Spieler,4,0)),\"Falsche Nummer!\",VLOOKUP(E6,Spieler,4,0)))","v":""},{"$f":"IF(ISERROR(VLOOKUP(E6,Spieler,3,0)),\"\",VLOOKUP(E6,Spieler,3,0))","v":""},"",null,"",null,null,null,null,{"$f":"IF(COUNT(G6:J6)>0,SUM(G6:J6),\"\")","v":""},{"$f":"IF(K6<>\"\",K6/COUNT(G6:J6),\"\")","v":""},{"$f":"IF(COUNT(G6:J6)>1,LARGE(G6:J6,1)-SMALL(G6:J6,1),\"\")","v":""},{"$f":"IF(F6<>\"\",VLOOKUP(F6,Kategorieliste,2,0),\"\")","v":""}]
["","","","",null,"",null,null,null,null,"","","",""]
["","","","",null,"",null,null,null,null,"","","",""]
["","","","",null,"",null,null,null,null,"","","",""]
["","","","",null,"",null,null,null,null,"","","",""]
["","","","",null,"",null,null,null,null,"","","",""]
["","","","",null,"",null,null,null,null,"","","",""]
["","","","",null,"",null,null,null,null,"","","",""]
["","","","",null,"",null,null,null,null,"","","",""]
["","","","",null,"",null,null,null,null,"","","",""]
["","","","",null,"",null,null,null,null,"","","",""]
["","","","",null,"",null,null,null,null,"","","",""]
["","","","",null,"",null,null,null,null,"","","",""]
["","","","",null,"",null,null,null,null,"","","",""]
["","","","",null,"",null,null,null,null,"","","",""]
["","","","",null,"",null,null,null,null,"","","",""]
["","","","",null,"",null,null,null,null,"","","",""]
["","","","",null,"",null,null,null,null,"","","",""]
["","","","",null,"",null,null,null,null,"","","",""]
["","","","",null,"",null,null,null,null,"","","",""]
["","","","",null,"",null,null,null,null,"","","",""]
["","","","",null,"",null,null,null,null,"","","",""]
["","","","",null,"",null,null,null,null,"","","",""]
["","","","",null,"",null,null,null,null,"","","",""]
["","","","",null,"",null,null,null,null,"","","",""]
["","","","",null,"",null,null,null,null,"","","",""]
["","","","",null,"",null,null,null,null,"","","",""]
["","","","",null,"",null,null,null,null,"","","",""]
["","","","",null,"",null,null,null,null,"","","",""]
["","","","",null,"",null,null,null,null,"","","",""]
["","","","",null,"",null,null,null,null,"","","",""]
["","","","",null,"",null,null,null,null,"","","",""]
["","","","",null,"",null,null,null,null,"","","",""]
["","","","",null,"",null,null,null,null,"","","",""]
["","","","",null,"",null,null,null,null,"","","",""]
["","","","",null,"",null,null,null,null,"","","",""]
["","","","",null,"",null,null,null,null,"","","",""]
["","","","",null,"",null,null,null,null,"","","",""]
["","","","",null,"",null,null,null,null,"","","",""]
["","","","",null,"",null,null,null,null,"","","",""]
["","","","",null,"",null,null,null,null,"","","",""]
["","","","",null,"",null,null,null,null,"","","",""]
["","","","",null,"",null,null,null,null,"","","",""]
["","","","",null,"",null,null,null,null,"","","",""]
["","","","",null,"",null,null,null,null,"","","",""]
["","","","",null,"",null,null,null,null,"","","",""]
["","","","",null,"",null,null,null,null,"","","",""]
["","","","",null,"",null,null,null,null,"","","",""]
["","","","",null,"",null,null,null,null,"","","",""]
["","","","",null,"",null,null,null,null,"","","",""]
["","","","",null,"",null,null,null,null,"","","",""]
["","","","",null,"",null,null,null,null,"","","",""]
["","","","",null,"",null,null,null,null,"","","",""]
["","","","",null,"",null,null,null,null,"","","",""]

{"sheet":"Kategoriewertung","index":3,"n_rows":3,"n_cols":13,"rows_kept":3,"cut":false,"hidden":false,"merged":[]}
[]
["I. Einzelwertung nach Kategorien"]
["Pl.","Nachname","Vorname","Verein","Sp.Nr.","Kat.","R1","R2","R3","R4","Ges.","ø","Diff."]

{"sheet":"Mannschaften","index":4,"n_rows":11,"n_cols":16,"rows_kept":11,"cut":false,"hidden":false,"merged":[[10,1,10,4],[3,4,3,5],[3,9,3,10]]}
["J. Mannschaftswertung:"]
[]
[]
[1,null,null,null,null,null,null,null,"Schnitt:",{"$f":"IF(COUNTIF(INDIRECT(\"G\"&ROW()+2&\":J\"&ROW()+AnzSp+1),\">0\")>0,K11/(COUNTIF(INDIRECT(\"G\"&ROW()+2&\":J\"&ROW()+AnzSp+1),\">0\")-COUNTIF(INDIRECT(\"L\"&ROW()+2&\":O\"&ROW()+AnzSp+1),\"X\")),0)","v":0}]
["Nr.:","Nachname","Vorname",null,"Sp.Nr.","Kat.","R1","R2","R3","R4","Wertung",null,null,null,null,"Gesamt"]
[1,{"$f":"IF(E6=\"\",\"\",IF(ISERROR(VLOOKUP(E6,Spieler,4,0)),\"Falsche Nummer!\",VLOOKUP(E6,Spieler,4,0)))","v":""},{"$f":"IF(ISERROR(VLOOKUP(E6,Spieler,3,0)),\"\",VLOOKUP(E6,Spieler,3,0))","v":""},null,null,{"$f":"IF(ISERROR(VLOOKUP(E6,Spieler,2,0)),\"\",VLOOKUP(E6,Spieler,2,0))","v":""},{"$f":"IF(ISERROR(VLOOKUP($E6,Ergebnisse,COLUMN()-4,0)),0,VLOOKUP($E6,Ergebnisse,COLUMN()-4,0))","v":0},0,0,0,{"$f":"IF(L6=\"X\",0,G6)+IF(M6=\"X\",0,H6)+IF(N6=\"X\",0,I6)+IF(O6=\"X\",0,J6)","v":0},{"$f":"IF(G6>0,IF(AND(COUNTIF(INDIRECT(\"Z\"&(ROW()+1-$A6&\"S\"&COLUMN()-5)&\":Z\"&(ROW()+AnzSp-$A6)&\"S\"&COLUMN()-5,0),\">0\")=AnzSp-1,G6=LARGE(INDIRECT(\"Z\"&(ROW()+1-$A6&\"S\"&COLUMN()-5)&\":Z\"&(ROW()+AnzSp-$A6)&\"S\"&COLUMN()-5,0),1),COUNTIF(INDIRECT(\"Z\"&(ROW()+1-$A6&\"S\"&COLUMN()-5)&\":Z\"&(ROW())&\"S\"&COLUMN()-5,0),G6)=1),\"X\",IF(AND(COUNTIF(INDIRECT(\"Z\"&(ROW()+1-$A6&\"S\"&COLUMN()-5)&\":Z\"&(ROW()+AnzSp-$A6)&\"S\"&COLUMN()-5,0),\">0\")=AnzSp,INDIRECT(\"Z\"&(ROW()+AnzSp+1-$A6)&\"S6\",0)>0,G6=LARGE(INDIRECT(\"Z\"&(ROW()+1-$A6&\"S\"&COLUMN()-5)&\":Z\"&(ROW()+AnzSp-$A6)&\"S\"&COLUMN()-5,0),1),COUNTIF(INDIRECT(\"Z\"&(ROW()+1-$A6&\"S\"&COLUMN()-5)&\":Z\"&(ROW())&\"S\"&COLUMN()-5,0),G6)<3),\"X\",IF(AND(COUNTIF(INDIRECT(\"Z\"&(ROW()+1-$A6&\"S\"&COLUMN()-5)&\":Z\"&(ROW()+AnzSp-$A6)&\"S\"&COLUMN()-5,0),\">0\")=AnzSp,INDIRECT(\"Z\"&(ROW()+AnzSp+1-$A6)&\"S6\",0)>0,G6=LARGE(INDIRECT(\"Z\"&(ROW()+1-$A6&\"S\"&COLUMN()-5)&\":Z\"&(ROW()+AnzSp-$A6)&\"S\"&COLUMN()-5,0),2),COUNTIF(INDIRECT(\"Z\"&(ROW()+1-$A6&\"S\"&COLUMN()-5)&\":Z\"&(ROW())&\"S\"&COLUMN()-5,0),G6)=1),\"X\",\"\"))),\"\")","v":""},"","","",{"$f":"SUM(G6:J6)","v":0}]
[2,"","",null,null,"",0,0,0,0,0,"","","","",{"$f":"SUM(G7:J7)","v":0}]
[3,"","",null,null,"",0,0,0,0,0,"","","","",0]
[4,"","",null,null,"",0,0,0,0,0,"","","","",0]
[5,"","",null,null,"",0,0,0,0,0,"","","","",0]
[null,{"$f":"IF(COUNT(INDIRECT(\"E\"&ROW()-AnzSp&\":E\"&ROW()-1))<=AnzSp-2,\"Kein Streicher\",IF(COUNT(INDIRECT(\"E\"&ROW()-AnzSp&\":E\"&ROW()-1))<=AnzSp-1,\"1 Streicher\",IF(AND(COUNT(INDIRECT(\"E\"&ROW()-AnzSp&\":E\"&ROW()-1))<=AnzSp,F11>0),\"2 Streicher\",\"Spieler Nr. \"&AnzSp&\" löschen und als Einzelspieler erfassen!\")))","v":"Kein Streicher"},null,null,null,{"$f":"COUNTIF(INDIRECT(\"F\"&(ROW()-AnzSp)&\":F\"&ROW()-1),\"Jw\")+COUNTIF(INDIRECT(\"F\"&ROW()-AnzSp&\":F\"&ROW()-1),\"Jm\")+COUNTIF(INDIRECT(\"F\"&ROW()-AnzSp&\":F\"&ROW()-1),\"Schw\")+COUNTIF(INDIRECT(\"F\"&ROW()-AnzSp&\":F\"&ROW()-1),\"Schm\")","v":0},{"$f":"IF(COUNTIF(INDIRECT(\"G\"&ROW()-AnzSp&\":G\"&ROW()-1),\">0\")=AnzSp-2,SUM(INDIRECT(\"G\"&ROW()-AnzSp&\":G\"&ROW()-1)),IF(COUNTIF(INDIRECT(\"G\"&ROW()-AnzSp&\":G\"&ROW()-1),\">0\")=AnzSp-1,SUM(INDIRECT(\"G\"&ROW()-AnzSp&\":G\"&ROW()-1))-LARGE(INDIRECT(\"G\"&ROW()-AnzSp&\":G\"&ROW()-1),1),IF(COUNTIF(INDIRECT(\"G\"&ROW()-AnzSp&\":G\"&ROW()-1),\">0\")=AnzSp,SUM(INDIRECT(\"G\"&ROW()-AnzSp&\":G\"&ROW()-1))-LARGE(INDIRECT(\"G\"&ROW()-AnzSp&\":G\"&ROW()-1),1)-LARGE(INDIRECT(\"G\"&ROW()-AnzSp&\":G\"&ROW()-1),2),0)))","v":0},{"$f":"IF(COUNTIF(INDIRECT(\"H\"&ROW()-AnzSp&\":H\"&ROW()-1),\">0\")=AnzSp-2,SUM(INDIRECT(\"H\"&ROW()-AnzSp&\":H\"&ROW()-1)),IF(COUNTIF(INDIRECT(\"H\"&ROW()-AnzSp&\":H\"&ROW()-1),\">0\")=AnzSp-1,SUM(INDIRECT(\"H\"&ROW()-AnzSp&\":H\"&ROW()-1))-LARGE(INDIRECT(\"H\"&ROW()-AnzSp&\":H\"&ROW()-1),1),IF(COUNTIF(INDIRECT(\"H\"&ROW()-AnzSp&\":H\"&ROW()-1),\">0\")=AnzSp,SUM(INDIRECT(\"H\"&ROW()-AnzSp&\":H\"&ROW()-1))-LARGE(INDIRECT(\"H\"&ROW()-AnzSp&\":H\"&ROW()-1),1)-LARGE(INDIRECT(\"H\"&ROW()-AnzSp&\":H\"&ROW()-1),2),0)))","v":0},{"$f":"IF(COUNTIF(INDIRECT(\"I\"&ROW()-AnzSp&\":I\"&ROW()-1),\">0\")=AnzSp-2,SUM(INDIRECT(\"I\"&ROW()-AnzSp&\":I\"&ROW()-1)),IF(COUNTIF(INDIRECT(\"I\"&ROW()-AnzSp&\":I\"&ROW()-1),\">0\")=AnzSp-1,SUM(INDIRECT(\"I\"&ROW()-AnzSp&\":I\"&ROW()-1))-LARGE(INDIRECT(\"I\"&ROW()-AnzSp&\":I\"&ROW()-1),1),IF(COUNTIF(INDIRECT(\"I\"&ROW()-AnzSp&\":I\"&ROW()-1),\">0\")=AnzSp,SUM(INDIRECT(\"I\"&ROW()-AnzSp&\":I\"&ROW()-1))-LARGE(INDIRECT(\"I\"&ROW()-AnzSp&\":I\"&ROW()-1),1)-LARGE(INDIRECT(\"I\"&ROW()-AnzSp&\":I\"&ROW()-1),2),0)))","v":0},{"$f":"IF(COUNTIF(INDIRECT(\"J\"&ROW()-AnzSp&\":J\"&ROW()-1),\">0\")=AnzSp-2,SUM(INDIRECT(\"J\"&ROW()-AnzSp&\":J\"&ROW()-1)),IF(COUNTIF(INDIRECT(\"J\"&ROW()-AnzSp&\":J\"&ROW()-1),\">0\")=AnzSp-1,SUM(INDIRECT(\"J\"&ROW()-AnzSp&\":J\"&ROW()-1))-LARGE(INDIRECT(\"J\"&ROW()-AnzSp&\":J\"&ROW()-1),1),IF(COUNTIF(INDIRECT(\"J\"&ROW()-AnzSp&\":J\"&ROW()-1),\">0\")=AnzSp,SUM(INDIRECT(\"J\"&ROW()-AnzSp&\":J\"&ROW()-1))-LARGE(INDIRECT(\"J\"&ROW()-AnzSp&\":J\"&ROW()-1),1)-LARGE(INDIRECT(\"J\"&ROW()-AnzSp&\":J\"&ROW()-1),2),0)))","v":0},{"$f":"SUM(G11:J11)","v":0}]

{"sheet":"Startliste","index":5,"n_rows":34,"n_cols":4,"rows_kept":34,"cut":false,"hidden":false,"merged":[[0,0,0,3],[11,0,11,3]]}
[{"$f":"Deckblatt!A3","v":"1. Spieltag  -  Bezirksklasse Nord  -  Saison 2022"}]
[]
[]
["Turnierleitung:",null,{"$f":"IF(Deckblatt!D6=0,\"\",Deckblatt!D6)","v":""},{"$f":"IF(Deckblatt!G6=0,\"\",Deckblatt!G6)","v":""}]
[]
["Oberschiedsrichter:",null,{"$f":"IF(Deckblatt!D8=0,\"\",Deckblatt!D8)","v":""},{"$f":"IF(Deckblatt!G8=0,\"\",Deckblatt!G8)","v":""}]
["Schiedsrichter:",null,{"$f":"IF(Deckblatt!D9=0,\"\",Deckblatt!D9)","v":""},{"$f":"IF(Deckblatt!G9=0,\"\",Deckblatt!G9)","v":""}]
["Schiedsrichter:",null,{"$f":"IF(Deckblatt!D10=0,\"\",Deckblatt!D10)","v":""},{"$f":"IF(Deckblatt!G10=0,\"\",Deckblatt!G10)","v":""}]
[]
[]
[]
["Startliste"]
[]
[1]
[2]
[3]
[4]
[5]
[6]
[7]
[8]
[9]
[10]
[11]
[12]
[13]
[14]
[15]
[16]
[17]
[18]
[19]
[20]
[21]

{"sheet":"Konstanten","index":6,"n_rows":37,"n_cols":7,"rows_kept":37,"cut":false,"hidden":true,"merged":[]}
[]
["Kurzbezeichnung","Reihenfolge",null,"Ligennummer","Ligenbezeichnung","Anzahl Spieler","Kategoriewertung"]
["D",1,null,1,"Bezirksklasse Nord",5,"Ja"]
["H",2,null,2,"Bezirksklasse Mitte",5,"Ja"]
["Sw 1",3,null,3,"Bezirksklasse Ost",5,"Ja"]
["Sm 1",4,null,4,"Bezirksklasse Süd",5,"Ja"]
["Sw 2",5,null,5,"Bezirksliga Nord-Mitte",5,"Ja"]
["Sm 2",6,null,6,"Landesliga Nord",6,"Nein"]
["Jw",7,null,7,"Landesliga Süd",6,"Nein"]
["Jm",8,null,8,"Verbandsliga Staffel 1",7,"Nein"]
["Schw",9,null,9,"Verbandsliga Staffel 2",7,"Nein"]
["Schm",10,null,10,"3. Bundesliga Nord Staffel 1",7,"Nein"]
[null,null,null,11,"3. Bundesliga Nord Staffel 2",7,"Nein"]
[null,null,null,12,"3. Bundesliga Nord Staffel 3",7,"Nein"]
[null,null,null,13,"2. Bundesliga Nord Staffel 1",8,"Nein"]
[null,null,null,14,"2. Bundesliga Nord Staffel 2",8,"Nein"]
[]
["1. Spieltag"]
["2. Spieltag"]
["3. Spieltag"]
["4. Spieltag"]
["5. Spieltag"]
[]
[]
[]
[]
["Aktuelle Auswahl Liga:",null,1]
["Aktuelle Auswahl Spieltag:",null,1]
["Aktuelle Anzahl der Runden",null,{"$f":"COUNT(Deckblatt!H23:K23)","v":0}]
["Anzahl der Spieler in Team",null,{"$f":"VLOOKUP(Ligawahl,Teamgröße,3,0)","v":5}]
[]
["Bahnensysteme",null,null,"blau","grün","rot"]
[null,"Miniaturgolf",1,19,24,29]
[null,"Beton",2,24,29,35]
[null,"Filzgolf",3,29,35,39]
[]
["Aktuelle Auswahl System:",null,{"$f":"VLOOKUP(Deckblatt!P9,Systemliste,2,0)","v":1},{"$f":"VLOOKUP(Deckblatt!P9,Systemliste,3,0)","v":19},{"$f":"VLOOKUP(Deckblatt!P9,Systemliste,4,0)","v":24},{"$f":"VLOOKUP(Deckblatt!P9,Systemliste,5,0)","v":29}]

{"sheet":"players","index":7,"n_rows":3665,"n_cols":12,"rows_kept":3665,"cut":false,"hidden":false,"merged":[]}
["SpielerNr","Kategorie","Vorname","Nachname","Kurzname","MVBN","LizenzNr","SC","SB","SA","TL","Verein"]
[25891,"Sm 2","Lothar","Abele",{"$f":"VLOOKUP(L2,Kurznamen,2,0)","v":"MGC Metzingen"},{"$f":"IF(VLOOKUP(L2,Kurznamen,3,0)=\"Ja\",\"Ja\",\"\")","v":""},"","","","","","1. Miniaturgolf Club Metzingen e. V."]
[869,"Sw 2","Birgit","Abeling-Betzien","BGC Diepholz","Ja","","","","","","Bahnen-Golf-Club Diepholz e. V."]
[33312,"Sm 2","Edgar","Abelmann","BGC Hannover","Ja","","","","","","1. Bahnen-Golf-Club Hannover e. V."]
[27712,"Sm 1","Thomas","Abendroth","Reinickendorfer MGC","","","","","","","Reinickendorfer Miniatur - Golfsport - Club e. V."]
[43272,"Sm 1","Hendrik","Ackermann","MGC Ludwigshafen","","","","","","","1. Miniatur-Golf-Club Ludwigshafen 1964 e. V."]
[34631,"H","Jan Sebastian","Adam","VfL Lüneburg","Ja",12733,"X","","","","Verein für Leibesübungen Lüneburg e. V. Abteilung Bahnengolf"]
[67154,"D","Jessica","Adam","VfL Lüneburg","Ja",29732,"X","","","","Verein für Leibesübungen Lüneburg e. V. Abteilung Bahnengolf"]
[67739,"Jm","Can","Adam","MC Weinheim","","","","","","","1. Miniaturgolf-Club Weinheim e. V."]
[36366,"Sm 2","Herbert","Adam","MGC Felderbachtal","","","","","","","Minigolf-Club-Felderbachtal 1964 e. V."]
[35408,"D","Jasmin","Adamczyk","MGC Bad Homburg","","","","","","","Minigolf-Club Bad Homburg e. V."]
[35377,"Sm 2","Michael","Adamczyk","MGC Bad Homburg","","","","","","","Minigolf-Club Bad Homburg e. V."]
[37108,"Sw 2","Astrid","Adamczyk","MGC Bad Homburg","","","","","","","Minigolf-Club Bad Homburg e. V."]
[35715,"Sm 2","Bernd","Adamski","MGC Wanne-Eickel","","","","","","","Minigolfclub Rot-Weiß Wanne-Eickel e. V."]
[46986,"Sm 1","Jürgen","Adenau","BGC Paffendorf","","","","","","","Bahnengolf Club Schloß Paffendorf e. V."]
[29794,"H","Markus","Affeld","MSC Herscheid","","","","","","","Minigolf-Sportclub Herscheid 1963 e. V."]
[24649,"H","Alan","Ahmed","MGC Bad Oldesloe","","","","","","","Miniaturgolfclub Bad Oldesloe von 1964 e. V."]
[36151,"Sm 1","Pasi","Aho","BGC Neutraubling","","","","","","","Bahnengolf-Club Neutraubling e. V."]
[37046,"Sw 1","Mabel","Ahrentropp","HMC Büttgen","","","","","","","Hobbysport Miniaturgolfclub Büttgen e. V."]
[66842,"D","Catharina","Aichele","MGC Monrepos","","","","","","","Minigolfclub Monrepos e. V."]
[66843,"Sm 2","Rainer","Aichele","MGC Hechingen","","","","","","","1. Minigolfclub Hechingen e. V."]
[27728,"H","Sascha","Albrecht","MGC Göttingen","Ja","","","","","","1. Miniatur-Golfsport-Club 1970 Göttingen e. V."]
[66650,"D","Nassim","Alizadeh","MC Schriesheim","","","","","","","Miniaturgolf Sportclub Schriesheim e. V."]
[67318,"Schm","Leon","Allmacher","MGC Traben-Trarbach","","","","","","","Minigolfclub Traben-Trarbach e. V."]
[67317,"Sm 1","Jürgen","Allmacher","MGC Traben-Trarbach","","","","","","","Minigolfclub Traben-Trarbach e. V."]
[33903,"Sm 1","Markus","Allmüller","BGV Backumer Tal","","","","","","","BGV Backumer Tal Herten e. V."]
[33902,"Sw 1","Bianca","Allmüller","BGV Backumer Tal","","","","","","","BGV Backumer Tal Herten e. V."]
[29237,"Sm 1","Peter","Amberger","BGC Neutraubling","","","","","","","Bahnengolf-Club Neutraubling e. V."]
[67242,"Sm 2","Tobias","Amely","MSC Bad Godesberg","","","","","","","Minigolf-Sport-Club Bad Godesberg e. V."]
[50612,"H","Oliver","Anders","CGC Hamm","","","","","","","Cobigolf-Verein Hamm 2019 e. V."]
[44990,"Sm 1","Alexander","Anders","BGSV Castrop","","","","","","","Bahnengolfsportverein Castrop e. V. 1961"]
[66492,"Sm 1","Uwe","Andrejewski","MC Gelsenkirchen","","","","","","","1. Minigolf Club Gelsenkirchen e. V."]
[66109,"Sm 1","Andre","Andresen","BGC Kiel-West","","","","","","","Bahnen-Golf-Club Kiel-West e. V."]
[37496,"Sm 2","Klaus-Dieter","Andresen","MGC Harrislee","","","","","","","Sportverein Minigolfclub Harrislee-Wassersleben e. V."]
[66201,"Sm 2","Bernd","Andrzejak","MGC Wanne-Eickel","","","","","","","Minigolfclub Rot-Weiß Wanne-Eickel e. V."]
[67210,"Sm 2","Karl-Heinz","Angrabeit","KGC Mönchengladbach","","","","","","","1. Klein-Golf-Club Mönchengladbach e. V."]
[67183,"Jm","Robin","Antholz","MSG Kempten","","","","","","","Minigolf-Sport-Gemeinschaft Kempten e. V."]
[66879,"Jm","Sean","Anton","BGV Rodalben","","","","","","","1. Bahnengolfverein Rodalben 1977 e. V."]
[27278,"Sm 2","Udo","Apelmeier","BV Sennestadt","","","","","","","BV Sennestadt e. V."]
[45054,"Sm 2","Willi","Appel","MC Schriesheim","","","","","","","Miniaturgolf Sportclub Schriesheim e. V."]
[29034,"H","André","Appelmann","MGC Epe","","","","","","","1. Minigolfclub Epe 1978 e. V."]
[36479,"D","Laura","Appelmann","MGC Epe","","","","","","","1. Minigolfclub Epe 1978 e. V."]
[47183,"Sm 1","Sascha","Arendt","BGSV Castrop","","","","","","","Bahnengolfsportverein Castrop e. V. 1961"]
[67250,"Sw 1","Angelina","Arendt","BGSV Castrop","","","","","","","Bahnengolfsportverein Castrop e. V. 1961"]
[27450,"Sm 1","Ingo","Arens","VfB Osnabrück","","","","","","","Verein für Bahnengolf Osnabrück von 1984 e. V."]
[26327,"H","Christoph","Arenz","MSC Bad Godesberg","","","","","","","Minigolf-Sport-Club Bad Godesberg e. V."]
[4769,"Sm 2","Heinz Josef","Arenz","MSC Bad Godesberg","","","","","","","Minigolf-Sport-Club Bad Godesberg e. V."]
[60227,"Sm 2","Gerhard","Arndt","VfL Lohbrügge","","","","","","","Verein für Leibesübungen Lohbrügge von 1892 e. V. Abteilung Bahnengolf"]
[35780,"H","Mark","Arnold","SG Arheilgen","","","","","","","Sportgemeinschaft Arheilgen 1876/1945 e. V. Abteilung Bahnengolf"]
[47324,"D","Simone","Arnold","MSC Bensheim-Auerbach","","","","","","","Minigolf-Sport-Club Bensheim-Auerbach e. V."]
[67764,"Schm","Leon","Arnold","BIG Ingelfingen","","","","","","","Bahnengolf Interessen-Gemeinschaft Ingelfingen 2020 e. V."]
[18435,"Sm 2","Klaus","Arnold","HMC Büttgen","","","","","","","Hobbysport Miniaturgolfclub Büttgen e. V."]
[35779,"Sm 2","Günter","Arnold","BSV Asslar","","","","","","","Bahnengolf-Sportverein Aßlar 1987 e. V."]
[35778,"Sw 2","Franziska","Arnold","BSV Asslar","","","","","","","Bahnengolf-Sportverein Aßlar 1987 e. V."]
[36179,"Sm 2","Marco","Arnsberg","MV Lankwitzer Dragons","","","","","","","MV Lankwitzer Dragons e. V."]
[66447,"Sm 2","Stefan","Arweiler","FZC Bliesen","","","","","","","Freizeit Club Bliesen e. V."]
[33616,"Sm 2","Jörg","Asmuß","MGC Brunsbüttel","","","","","","","Miniaturgolf-Club Brunsbüttel e. V."]
[23975,"Sm 2","Bernd","Aßmuth","Bochumer MC","","","","","","","Bochumer Minigolf-Club 1960 e. V."]
[67563,"H","Daniel","Atzert","MGC Bad Homburg","","","","","","","Minigolf-Club Bad Homburg e. V."]
[29208,"Sm 1","Thomas","Aussieker","BGSV Castrop","","","","","","","Bahnengolfsportverein Castrop e. V. 1961"]
[66405,"Sw 1","Manuela","Aust","BSC Ennepetal","","","","","","","Bahngolf-Sport-Club Ennepetal e. V."]
[67205,"Sm 2","Jürgen","Aust","VfM Bottrop","","","","","","","Verein für Minigolf Bottrop e. V."]
[67206,"Sw 2","Petra","Aust","VfM Bottrop","","","","","","","Verein für Minigolf Bottrop e. V."]
[15754,"H","Sascha","Axer","Kölner MC","","","","","","","Kölner Miniatur Golf Club e. V."]
[49266,"Sm 2","Reiner","Axer","Kölner MC","","","","","","","Kölner Miniatur Golf Club e. V."]
[49267,"Sw 2","Claudia","Axer",{"$f":"VLOOKUP(L66,Kurznamen,2,0)","v":"Kölner MC"},{"$f":"IF(VLOOKUP(L66,Kurznamen,3,0)=\"Ja\",\"Ja\",\"\")","v":""},"","","","","","Kölner Miniatur Golf Club e. V."]
[29229,"Sm 1","Manfred","Axtner","CGC Illertal","","","","","","","Cobigolfclub Illertal Kellmünz e. V."]
[19768,"Sm 2","Stjepan","Babic","BIG Asperg","","","","","","","Bahnengolf-Interessen-Gemeinschaft Asperg e. V. 1982"]
[4444,"Sm 2","Peter","Bach","MGC Oberkochen","","","","","","","Miniatur-Golfclub Oberkochen 1972 e. V."]
[67453,"Sm 2","Manfred","Bach","BGC Paffendorf","","","","","","","Bahnengolf Club Schloß Paffendorf e. V."]
[29939,"Sm 1","Peter","Bachmann","MGC Göttingen","Ja",9533,"","X","","","1. Miniatur-Golfsport-Club 1970 Göttingen e. V."]
[43674,"Sw 1","Sabine","Bachmann","MGC Göttingen","Ja","","","","","","1. Miniatur-Golfsport-Club 1970 Göttingen e. V."]
[35588,"Sm 2","Robert","Bader","MGC Murnau","","","","","","","Minigolfclub Murnau am Staffelsee e. V."]
[35587,"Sw 2","Elfriede","Bader","MGC Murnau","","","","","","","Minigolfclub Murnau am Staffelsee e. V."]
[43414,"Sm 2","Gerhard","Badtke","BGC Bad Nenndorf","Ja",17979,"","X","","X","Bahnen-Golf-Club Bad Nenndorf e. V."]
[46800,"Sw 2","Monika","Badtke","BGC Bad Nenndorf","Ja","","","","","","Bahnen-Golf-Club Bad Nenndorf e. V."]
[37761,"Sm 1","Torsten","Badziong","MGC Biebertal","","","","","","","Miniatur-Golf-Club Freizeitzentrum Biebertal e. V."]
[37355,"Sm 2","Uwe","Baer","BGC Weseling","","","","","","","1. Bahnen-Golf-Club Wesseling 1975 e. V. "]
[44139,"Sm 1","Thomas","Bahr","BGV Backumer Tal","","","","","","","BGV Backumer Tal Herten e. V."]
[67618,"Jw","Noelle","Bähr","NDE Miniaturgolf","","","","","","","Niendorfer Miniaturgolf-Club von 1963 e. V."]
[67619,"Schm","Jonas","Bähr","NDE Miniaturgolf","","","","","","","Niendorfer Miniaturgolf-Club von 1963 e. V."]
[46033,"Sm 1","Sascha","Bähr","NDE Miniaturgolf","","","","","","","Niendorfer Miniaturgolf-Club von 1963 e. V."]
[29699,"Sm 2","Hans","Baier","MGC Oberkochen","","","","","","","Miniatur-Golfclub Oberkochen 1972 e. V."]
[37654,"Sm 2","Dieter","Baierl","MGC Ingolstadt","","","","","",""," Miniaturgolf-Club Ingolstadt e. V."]
[37653,"Sw 2","Andrea","Baierl","MGC Ingolstadt","","","","","",""," Miniaturgolf-Club Ingolstadt e. V."]
[67478,"Jm","Ghulam Dastgeer","Baig","MGC Wetzlar","","","","","","","Miniatur-Golf-Club Wetzlar e. V."]
[48505,"Sm 2","Varyam-Mirza","Baig","MGC Wetzlar","","","","","","","Miniatur-Golf-Club Wetzlar e. V."]
[33109,"Sm 2","Heinz","Balbach","MGC Unterschneidheim","","","","","","","Minigolfclub Unterschneidheim e. V."]
[67268,"Sm 2","Thomas","Baldauf","BSG Fürstenwalde","","","","","","","BSG Pneumant Fürstenwalde e. V. Abteilung Minigolf"]
[66669,"Sm 2","Thomas","Balf","BGC Uerdingen","","","","","","","Bahnengolf-Club Uerdingen e. V."]
[67281,"H","Kreon","Balis","Münchener MC","","","","","","","1. Münchener Minigolf-Club 1962 e. V."]
[3776,"Sm 2","Helmut","Ballbach","BGV Rodalben","","","","","","","1. Bahnengolfverein Rodalben 1977 e. V."]
[40671,"Sw 2","Blandine","Ballbach","BGV Rodalben","","","","","","","1. Bahnengolfverein Rodalben 1977 e. V."]
[33514,"H","Christian","Balleininger","MGC Bamberg","","","","","","","1. Minigolfclub Bamberg e. V."]
[5910,"Sm 2","Lyo","Balleininger","MGC Bamberg","","","","","","","1. Minigolfclub Bamberg e. V."]
[40906,"D","Yvonne","Baltes","MSC Bad Godesberg","","","","","","","Minigolf-Sport-Club Bad Godesberg e. V."]
[5073,"Sm 2","Max","Balzereit","BSC Ennepetal","","","","","","","Bahngolf-Sport-Club Ennepetal e. V."]
[67610,"D","Annabelle","Balzter","SG Arheilgen","","","","","","","Sportgemeinschaft Arheilgen 1876/1945 e. V. Abteilung Bahnengolf"]
[38190,"H","Dennis","Bamberg","MGC St. Ingbert","","","","","","","1. Minigolf-Club Saar 68 St. Ingbert e. V."]
[25993,"Sw 1","Gabriele","Bamberg","MGC Mainz","","","","","","","Erster Mainzer Minigolf-Club e. V. 1964"]
[42482,"Sm 2","Michael","Bamberg","MGC Mainz","","","","","","","Erster Mainzer Minigolf-Club e. V. 1964"]
[48318,"H","Tobias","Bär","MGC Bad Hersfeld","","","","","","","Miniatur-Golf-Club Bad Hersfeld e. V."]
[67555,"D","Dana","Bär","MGC Brunsbüttel","","","","","","","Miniaturgolf-Club Brunsbüttel e. V."]
[38333,"Sw 1","Claudia","Barber","MGC Würzburg","","","","","","","Miniaturgolfsportverein Würzburg - Löwenbrücke e. V."]
[43841,"Sm 1","Jens","Bardenhagen","MGC Brunsbüttel","","","","","","","Miniaturgolf-Club Brunsbüttel e. V."]
[25214,"Sm 2","Stefan","Bärenz","SV Dreieichenhain","","","","","","","Sportverein 1890 e. V. Dreieichenhain Abteilung Bahnengolf"]
[37576,"Sm 2","Bernd","Bargenda","MGC Harrislee","","","","","","","Sportverein Minigolfclub Harrislee-Wassersleben e. V."]
[67241,"Sm 1","Heinz","Bark","SC Dortmund","","","","","","","Sport-Club Olympia Dortmund e. V. "]
[36967,"Sm 1","Thomas","Barke","MSC Wesel","","","","","","","1. Minigolf-Sportclub Wesel 66 66 e. V. "]
[38123,"Sm 1","Mario","Barke","Essener CGC","","","","","","","1. Essener cobiGOLF - Club \"Blau-Gold\" e. V."]
[29656,"H","René","Barlog","Bochumer MC","","","","","","","Bochumer Minigolf-Club 1960 e. V."]
[66068,"Sm 2","Hermann","Barnstorf","BGC Celle","Ja","","","","","","1. Bahnen-Golf-Club Celle von 1964 e. V."]
[36395,"Sm 2","Harald","Barth","BGC Weseling","","","","","","","1. Bahnen-Golf-Club Wesseling 1975 e. V. "]
[66777,"H","Patrick","Bartholomä","MGC Lohfelden","Ja",29104,"","","","X","1. Miniatur-Golfsport-Club Lohfelden e. V."]
[66896,"H","Pierre","Bartholomä","MGC Lohfelden","Ja",29246,"X","","","","1. Miniatur-Golfsport-Club Lohfelden e. V."]
[41145,"Sm 1","Volker","Bartmann","Essener CGC","","","","","","","1. Essener cobiGOLF - Club \"Blau-Gold\" e. V."]
[67404,"Sm 2","Paul","Bartsch","BV Sennestadt","","","","","","","BV Sennestadt e. V."]
[38103,"H","Patrick","Barz","VfM Berlin","","","","","","","Verein für Minigolf e. V. Berlin"]
[38102,"Sw 1","Birgit","Barz","VfM Berlin","","","","","","","Verein für Minigolf e. V. Berlin"]
[46055,"Sm 2","Andreas","Barz","MGC Olympia Kiel","","","","","","","Miniaturgolfclub Olympia Kiel e. V."]
[44254,"Sm 1","Sven","Basse","NDE Miniaturgolf","","","","","","","Niendorfer Miniaturgolf-Club von 1963 e. V."]
[37582,"D","Ann-Kathrin","Bastian","BGC Bildstock","","","","","","","Bahnen-Golf-Club Bildstock e. V."]
[37583,"Sw 2","Claudia","Bastian","BGC Bildstock","","","","","","","Bahnen-Golf-Club Bildstock e. V."]
[46910,"Sm 2","Richard","Bätge","SV Gebhardshagen","Ja",20059,"","","","X","SV Glück Auf 1901 Gebhardshagen e. V. Abteilung Minigolf"]
[65848,"H","Adrian","Batschkus","Münchener MC","","","","","","","1. Münchener Minigolf-Club 1962 e. V."]
[66273,"Jm","Quirin","Batschkus","Münchener MC","","","","","","","1. Münchener Minigolf-Club 1962 e. V."]
[23741,"Sm 2","Wolfgang","Battig","MC Lüdenscheid","","","","","","","MC 62 Lüdenscheid e. V."]
[37799,"H","Jan Hendrik","Battling","MGC Witten","","","","","","","Minigolfclub \"AS\" Witten 1963 e. V."]
[34490,"Sm 1","Thomas","Bätz","MSC Bad Godesberg","","","","","","","Minigolf-Sport-Club Bad Godesberg e. V."]
[40471,"Sm 1","Helmut","Bauer",{"$f":"VLOOKUP(L130,Kurznamen,2,0)","v":"MGC München"},{"$f":"IF(VLOOKUP(L130,Kurznamen,3,0)=\"Ja\",\"Ja\",\"\")","v":""},"","","","","","1. Miniaturgolfclub München-Feldmoching e. V."]
[46532,"Sm 1","Siegfried","Bauer","BGC Bad Berneck","","","","","","","Bahnengolf-Club e. V. Bad Berneck"]
[44002,"Sw 1","Jutta","Bauer","BGC Bad Berneck","","","","","","","Bahnengolf-Club e. V. Bad Berneck"]
[40864,"Sm 2","Martin","Bauer","BGC Bildstock","","","","","","","Bahnen-Golf-Club Bildstock e. V."]
[5751,"Sm 2","Helmut","Bauerfeld","FZC Bliesen","","","","","","","Freizeit Club Bliesen e. V."]
[36137,"Sw 1","Barbara","Bauermeister","MGC Murnau","","","","","","","Minigolfclub Murnau am Staffelsee e. V."]
[28605,"Sm 2","Stephan","Bauermeister","MGC Murnau","","","","","","","Minigolfclub Murnau am Staffelsee e. V."]
[46616,"Sm 1","Marcus","Bauhofer","BGC Heilbronn","","","","","","","Bahnengolf Club Heilbronn e. V."]
[65195,"Sm 2","Harald","Baumann","BGC Paffendorf","","","","","","","Bahnengolf Club Schloß Paffendorf e. V."]
[26398,"H","Daniel","Baumer","MGC München","","","","","","","1. Miniaturgolfclub München-Feldmoching e. V."]
[3998,"Sm 2","Klaus","Baumer","BGC Illertissen","","","","","","","Bahnengolfclub Illertissen e. V."]
[47033,"Sw 2","Ruth","Baumer","BGC Illertissen","","","","","","","Bahnengolfclub Illertissen e. V."]
[37760,"H","Thorben","Baumgart","SGC Hagen","","","","","","","Sterngolf-Club Hagen e. V."]
[29220,"Sm 1","Dirk","Baumgart","MSK Neheim-Hüsten","","","","","","","MINIGOLF-SPORT-KLUB Neheim-Hüsten e. V."]
[38226,"H","Wolfgang","Bäurle","FMGC Lichtenfels","","","","","","","1. Fränkischer Minigolfclub Lichtenfels 1961 e. V."]
[67374,"Jm","Tobias","Bayer","BIG Asperg","","","","","","","Bahnengolf-Interessen-Gemeinschaft Asperg e. V. 1982"]
[67687,"Schm","Jannik","Bayer","BIG Asperg","","","","","","","Bahnengolf-Interessen-Gemeinschaft Asperg e. V. 1982"]
[38632,"Sm 1","Jimmy","Bayer","MGC Murnau","","","","","","","Minigolfclub Murnau am Staffelsee e. V."]
[66645,"Sm 1","Wolfgang","Bayer","MGC Murnau","","","","","","","Minigolfclub Murnau am Staffelsee e. V."]
[5942,"Sm 2","Hubert","Bayer","BGC Schweinfurt","","","","","","","Bahnengolfclub Schweinfurt e. V."]
[67061,"Sm 2","Willi","Bayer","BIG Asperg","","","","","","","Bahnengolf-Interessen-Gemeinschaft Asperg e. V. 1982"]
[66112,"Sm 2","Erich","Beausencourt","MGC Diessen","","","","","","","Minigolf-Club Diessen e. V."]
[66500,"Sw 1","Andrea","Becher","BGC Landshut","","","","","","","1. Bahnengolf-Club Landshut e. V."]
[66892,"H","Christian","Beck","BGC Landshut","","","","","","","1. Bahnengolf-Club Landshut e. V."]
[46021,"Sm 2","Bernhard","Beck","KC Homburg","","","","","","","1. Kleingolf Club Homburg-Saar 1967 e. V."]
[37559,"H","Florian","Becker","MSK Neheim-Hüsten","","","","","","","MINIGOLF-SPORT-KLUB Neheim-Hüsten e. V."]
[38570,"H","Jan","Becker","SG Arheilgen","","","","","","","Sportgemeinschaft Arheilgen 1876/1945 e. V. Abteilung Bahnengolf"]
[66162,"H","Lars","Becker","SG Arheilgen","","","","","","","Sportgemeinschaft Arheilgen 1876/1945 e. V. Abteilung Bahnengolf"]
[67566,"H","Christian","Becker","Bochumer MC","","","","","","","Bochumer Minigolf-Club 1960 e. V."]
[67596,"H","Mike","Becker","BGC Dormagen","","","","","","","Bahnengolf-Club Dormagen e. V."]
[67685,"H","Marcel","Becker","MGC Mainz","","","","","","","Erster Mainzer Minigolf-Club e. V. 1964"]
[35103,"D","Daniela","Becker","MGC Heven","","","","","","","Miniatur - Golf - Club Heven e. V."]
[38593,"D","Anna Lisa","Becker","MGC St. Ingbert","","","","","","","1. Minigolf-Club Saar 68 St. Ingbert e. V."]
[33442,"Sm 1","Martin","Becker","Reinickendorfer MGC","","","","","","","Reinickendorfer Miniatur - Golfsport - Club e. V."]
[37225,"Sm 1","Michael","Becker","SG Weiterstadt","","","","","","","Sportgemeinde 1886 e. V. Weiterstadt Abteilung Bahnengolf"]
[67480,"Sm 1","Jochen","Becker","Reinickendorfer MGC","","","","","","","Reinickendorfer Miniatur - Golfsport - Club e. V."]
[3591,"Sm 2","Werner","Becker","BSV Inzlingen","","","","","","","Bahnengolf-Sportverein Inzlingen 1979 e. V."]
[12781,"Sm 2","Hans-Dieter","Becker","MSK Neheim-Hüsten","","","","","","","MINIGOLF-SPORT-KLUB Neheim-Hüsten e. V."]
[26506,"Sm 2","Gerd","Becker","Rot-Weiß Syburg","","","","","","","Rot-Weiß Syburg 1960 e. V."]
[40005,"Sm 2","Michael","Becker","SGC Hagen","","","","","","","Sterngolf-Club Hagen e. V."]
[44304,"Sm 2","Norbert","Becker","SG Arheilgen","","","","","","","Sportgemeinschaft Arheilgen 1876/1945 e. V. Abteilung Bahnengolf"]
[4101,"Sw 2","Erika","Becker","Rot-Weiß Syburg","","","","","","","Rot-Weiß Syburg 1960 e. V."]
[25999,"Sw 2","Ursula","Becker","MGC Mannheim","","","","","","","1. Miniatur-Golf-Club Mannheim 1968 e. V."]
[44303,"Sw 2","Karin","Becker","SG Arheilgen","","","","","","","Sportgemeinschaft Arheilgen 1876/1945 e. V. Abteilung Bahnengolf"]
[26620,"Sm 2","Thomas","Beckmann","MSK Neheim-Hüsten","","","","","","","MINIGOLF-SPORT-KLUB Neheim-Hüsten e. V."]
[34186,"H","Stephan","Behrens","NDE Miniaturgolf","","","","","","","Niendorfer Miniaturgolf-Club von 1963 e. V."]
[67123,"Jm","Julien","Behrens","BGC Goslar","Ja","","","","","","Bahnen-Golf-Club Goslar e. V."]
[65679,"Sw 1","Susanne","Behrens","BGC Goslar","Ja","","","","","","Bahnen-Golf-Club Goslar e. V."]
[65678,"Sm 2","Friedhelm","Behrens","BGC Goslar","Ja","","","","","","Bahnen-Golf-Club Goslar e. V."]
[65677,"Sw 2","Christiane","Behrens","BGC Goslar","Ja","","","","","","Bahnen-Golf-Club Goslar e. V."]
[42528,"Sm 2","Jürgen","Beier","FMGC Lichtenfels","","","","","","","1. Fränkischer Minigolfclub Lichtenfels 1961 e. V."]
[42529,"Sm 2","Harald","Beier","FMGC Lichtenfels","","","","","","","1. Fränkischer Minigolfclub Lichtenfels 1961 e. V."]
[66569,"Sm 2","Christian","Beier","MC Möve Cuxhaven","Ja",28681,"","X","","","Miniaturgolf-Club \"Möve\" Cuxhaven-Sahlenburg e. V."]
[67528,"D","Sophie","Beining","Osnabrücker MC","","","","","","","Osnabrücker Minigolf Club von 1963 e. V."]
[60102,"Sm 2","Helmut","Beißwenger","Hamburger MC","","","","","","","Hamburger Minigolf Club von 1965 e. V."]
[67790,"H","Helmut","Belhustede","BGV Backumer Tal","","","","","","","BGV Backumer Tal Herten e. V."]
[28085,"H","Mario","Bell","MGC Bad Bodendorf","","","","","","","Miniaturgolfclub Bad Bodendorf e. V."]
[36192,"Sm 2","Hans-Jürgen","Bellanger","MGC Mannheim","","","","","","","1. Miniatur-Golf-Club Mannheim 1968 e. V."]
[36191,"Sw 2","Martina","Bellanger","MGC Mannheim","","","","","","","1. Miniatur-Golf-Club Mannheim 1968 e. V."]
[33091,"H","Marvin","Below","MGC Olympia Kiel","","","","","","","Miniaturgolfclub Olympia Kiel e. V."]
[37097,"H","Gerrit","Below","MGC Olympia Kiel","","","","","","","Miniaturgolfclub Olympia Kiel e. V."]
[42124,"Sm 1","Ralf","Belz","MGC Dormagen-Brechten","","","","","","","Minigolfclub Dormagen - Brechten e. V."]
[6059,"Sm 2","Lutz","Bemmann","BSV Leipzig","","","","","","","BSV AOK Leipzig e. V."]
[35539,"D","Jasmin","Beneking","MSK Neheim-Hüsten","","","","","","","MINIGOLF-SPORT-KLUB Neheim-Hüsten e. V."]
[183,"Sm 2","Erwin","Beneking",{"$f":"VLOOKUP(L194,Kurznamen,2,0)","v":"VfB Osnabrück"},{"$f":"IF(VLOOKUP(L194,Kurznamen,3,0)=\"Ja\",\"Ja\",\"\")","v":""},"","","","","","Verein für Bahnengolf Osnabrück von 1984 e. V."]
[33623,"H","Marius","Benkert","MGC Ostheim/Rhön","","","","","","","Miniaturgolfclub Ostheim/Rhön e. V. "]
[37425,"D","Katharina","Benkert","MGC Ostheim/Rhön","","","","","","","Miniaturgolfclub Ostheim/Rhön e. V. "]
[66790,"Sm 2","Holger","Benn","VfL Lohbrügge","","","","","","","Verein für Leibesübungen Lohbrügge von 1892 e. V. Abteilung Bahnengolf"]
[67813,"Sm 2","Rainer","Benz","BGSC Gladbeck","","","","","","","Bahnengolfsportclub \"Gut Schlag\" Gladbeck e. V."]
[67812,"Sw 2","Cornelia","Benz","BGSC Gladbeck","","","","","","","Bahnengolfsportclub \"Gut Schlag\" Gladbeck e. V."]
[37894,"H","Adam","Ber","MGC Karlshagen","","","","","","","Minigolfclub Karlshagen e. V."]
[38210,"D","Jessica","Ber","MGC Karlshagen","","","","","","","Minigolfclub Karlshagen e. V."]
[37630,"Sm 2","Peter","Ber","MGC Karlshagen","","","","","","","Minigolfclub Karlshagen e. V."]
[37872,"Sw 2","Elvira","Ber","MGC Karlshagen","","","","","","","Minigolfclub Karlshagen e. V."]
[2083,"H","Peter","Ber Jun.","MGC Karlshagen","","","","","","","Minigolfclub Karlshagen e. V."]
[67459,"H","Sebastian","Bergau","BGC Celle","Ja","","","","","","1. Bahnen-Golf-Club Celle von 1964 e. V."]
[67460,"D","Sandra","Bergau","BGC Celle","Ja","","","","","","1. Bahnen-Golf-Club Celle von 1964 e. V."]
[67461,"Schm","Linus","Bergau","BGC Celle","Ja","","","","","","1. Bahnen-Golf-Club Celle von 1964 e. V."]
[37997,"Sm 2","Gerhard","Bergauer","BGC Bochum","","","","","","","Bahnengolf-Sportclub Bochum 1978 e. V."]
[46384,"Sm 1","Martin","Berger","VfM Berlin","","","","","","","Verein für Minigolf e. V. Berlin"]
[66786,"H","Dominik","Berghof","SV Lurup","","","","","","","Sportverein Lurup-Hamburg von 1923 e. V. Abteilung Bahnengolf"]
[38591,"Sm 2","Günter","Bergmaier","MGC Bad Feilnbach","","","","","","","Minigolfclub Bad Feilnbach e. V."]
[34067,"H","Lars","Bergmann","SSC Halver","","","","","","","SSC Halver e. V."]
[66013,"Sm 1","Uwe","Bergmann","MGC Mainz","","","","","","","Erster Mainzer Minigolf-Club e. V. 1964"]
[5537,"Sw 2","Waltraut","Bergmann","BGC Heilbronn","","","","","","","Bahnengolf Club Heilbronn e. V."]
[67774,"Sw 2","Ingrid","Bergmeier","MGC Bad Salzuflen","","","","","","","Minigolf-Club Bad Salzuflen e. V."]
[40559,"Sm 1","Reiner","Bergsmann","MGC Sulzfeld","","","","","","","Miniatur Golf Club Sulzfeld e. V."]
[29362,"Sm 1","Patrick","Beringhausen","MGC Mainz","","","","","","","Erster Mainzer Minigolf-Club e. V. 1964"]
[6581,"Sm 2","Franz-Josef","Berkenkopf","MSK Neheim-Hüsten","","","","","","","MINIGOLF-SPORT-KLUB Neheim-Hüsten e. V."]
[67824,"D","Frederike","Berndt","TSV Arendsee","","","","","","","Turn- und Sportverein Arendsee e. V. Abteilung Minigolf"]
[67825,"H","Sebastian","Berndt-Tietke","TSV Arendsee","","","","","","","Turn- und Sportverein Arendsee e. V. Abteilung Minigolf"]
[48006,"Sw 1","Susanne","Berneit","MGC Tuttlingen","","","","","","","Erster Minigolf - Club Tuttlingen e. V."]
[42851,"Sm 1","Frank","Bernhard","SSC Attendorn","","","","","","","Sterngolf-Sport-Club Attendorn e. V."]
[66512,"D","Erika","Bernhardt","MGC Tuttlingen","","","","","","","Erster Minigolf - Club Tuttlingen e. V."]
[23895,"Sm 2","Hans-Jürgen","Berschansky","TSV Salzgitter","Ja","","","","","","Turn- und Sportverein Salzgitter e. V. Abteilung Bahnengolf"]
[52088,"Sw 1","Yvonne","Berthel-Nelles","BGC Wolfsburg","Ja","","","","","","1. Bahnen - Golf - Club Wolfsburg e. V."]
[44982,"Sm 1","Christian","Beschorner","MGC Biebertal","","","","","","","Miniatur-Golf-Club Freizeitzentrum Biebertal e. V."]
[30217,"Sm 1","Roland","Best","NMC Kelheim","","","","","","","1. Niederbayerischer Minigolf-Club Kelheim e. V."]
[67391,"Sw 1","Lucie","Betsch","BGS Hardenberg","","","","","","","BGS Hardenberg-Pötter e. V."]
[29631,"Sm 1","Marco","Bettger","MSC Wesel","","","","","","","1. Minigolf-Sportclub Wesel 66 66 e. V. "]
[41029,"Sm 2","Norbert","Betz","BGC Bad Berneck","","","","","","","Bahnengolf-Club e. V. Bad Berneck"]
[25369,"D","Nicole","Betzholz","CKF Dudweiler","","","","","","","l. Club der Kleingolf - Freunde Dudweiler e. V."]
[31966,"Sm 2","Horst","Betzholz","CKF Dudweiler","","","","","","","l. Club der Kleingolf - Freunde Dudweiler e. V."]
[32105,"H","André","Betzien","BGC Diepholz","Ja",10819,"X","","","","Bahnen-Golf-Club Diepholz e. V."]
[27202,"Sm 2","Jürgen","Beutin","MGC Ludwigshafen","","","","","","","1. Miniatur-Golf-Club Ludwigshafen 1964 e. V."]
[47156,"H","Bernd","Beutler","BGSV Castrop","","","","","","","Bahnengolfsportverein Castrop e. V. 1961"]
[46243,"Sm 2","Hartmut","Bever","MC Gelsenkirchen","","","","","","","1. Minigolf Club Gelsenkirchen e. V."]
[67193,"Jm","Lukas","Beyer","MGC Kassel","Ja","","","","","","1. Mini-Golfsport-Club Kassel-Vellmar 1964 e. V."]
[67192,"Sm 2","Frank","Beyer","MGC Kassel","Ja","","","","","","1. Mini-Golfsport-Club Kassel-Vellmar 1964 e. V."]
[67782,"Sw 2","Sabine","Beyer","BSG Fürstenwalde","","","","","","","BSG Pneumant Fürstenwalde e. V. Abteilung Minigolf"]
[65844,"Sm 2","Siegfried","Biastoch","BGV Backumer Tal","","","","","","","BGV Backumer Tal Herten e. V."]
[66914,"Sm 2","Detlef","Bieber","BGC Celle","Ja","","","","","","1. Bahnen-Golf-Club Celle von 1964 e. V."]
[40050,"H","Maik","Biedron","MC Möve Cuxhaven","Ja","","","","","","Miniaturgolf-Club \"Möve\" Cuxhaven-Sahlenburg e. V."]
[33681,"Sm 1","Thomas","Biehl","BGC Schweinfurt","","","","","","","Bahnengolfclub Schweinfurt e. V."]
[35862,"Sm 1","Frank","Bielak","BSC Ennepetal","","","","","","","Bahngolf-Sport-Club Ennepetal e. V."]
[67244,"H","Swen","Bielmann","MC Gelsenkirchen","","","","","","","1. Minigolf Club Gelsenkirchen e. V."]
[63302,"Sm 2","Kurt","Bien","MGC Ludwigshafen","","","","","","","1. Miniatur-Golf-Club Ludwigshafen 1964 e. V."]
[28606,"Sm 2","Florian","Bieringer","MGC Murnau","","","","","","","Minigolfclub Murnau am Staffelsee e. V."]
[33608,"H","Christoph","Biermann","MC Künsebeck","","","","","","","Miniaturgolf Club Tigers Künsebeck e. V."]
[67818,"Sm 2","Hubertus","Biermann","MGC Paderborn","","","","","","","1. Minigolf-Club Paderborn 1980 e. V."]
[67486,"H","Mario","Biller","MGC Brunsbüttel","","","","","","","Miniaturgolf-Club Brunsbüttel e. V."]
[46401,"Sm 1","Manfred","Biller","BGC Neutraubling","","","","","","","Bahnengolf-Club Neutraubling e. V."]
[66651,"Sw 1","Christine","Biller","BGC Neutraubling","","","","","","","Bahnengolf-Club Neutraubling e. V."]
[67098,"Sm 2","Manfred","Binder","MGC Harrislee","","","","","","","Sportverein Minigolfclub Harrislee-Wassersleben e. V."]
[31142,"D","Nicole","Birkelbach","MGC Göttingen","Ja","","","","","","1. Miniatur-Golfsport-Club 1970 Göttingen e. V."]
[35522,"Sm 1","Nicolai","Bischoff","Hamburger MC","","","","","","","Hamburger Minigolf Club von 1965 e. V."]
[65516,"Sm 2","Frank","Bischoff","BSV Inzlingen","","","","","","","Bahnengolf-Sportverein Inzlingen 1979 e. V."]
[48247,"Sm 1","Frank","Bissinger","MGC Monrepos","","","","","","","Minigolfclub Monrepos e. V."]
[67004,"Sw 1","Vera","Bissinger",{"$f":"VLOOKUP(L258,Kurznamen,2,0)","v":"MGC Monrepos"},{"$f":"IF(VLOOKUP(L258,Kurznamen,3,0)=\"Ja\",\"Ja\",\"\")","v":""},"","","","","","Minigolfclub Monrepos e. V."]
[30713,"H","Martin","Bittner","MGC Murnau","","","","","","","Minigolfclub Murnau am Staffelsee e. V."]
[31649,"Sm 1","Peter Klaus","Bittner","BSV Bad Homburg","","","","","","","Bahnengolf-Sportverein Bad Homburg v.d.H. e. V."]
[46690,"Sm 1","Christian","Bittner","MGC Murnau","","","","","","","Minigolfclub Murnau am Staffelsee e. V."]
[36974,"H","Alexander","Blanckarts","BGC Hannover","Ja","","","","","","1. Bahnen-Golf-Club Hannover e. V."]
[67532,"D","Lara","Blanckarts","BGC Hannover","Ja","","","","","","1. Bahnen-Golf-Club Hannover e. V."]
[67678,"Schw","Vivien","Blandino Vilchez","BGC Hannover","Ja","","","","","","1. Bahnen-Golf-Club Hannover e. V."]
[35663,"Sw 1","Nicole","Blasek","MGC Köln","","","","","","","1. Minigolf-Club Köln 1961 e. V."]
[66402,"H","Marc","Bläsing","BGS Hardenberg","","","","","","","BGS Hardenberg-Pötter e. V."]
[66403,"D","Julia","Bläsing","BGS Hardenberg","","","","","","","BGS Hardenberg-Pötter e. V."]
[66906,"Schm","Leon","Bläsing","BGS Hardenberg","","","","","","","BGS Hardenberg-Pötter e. V."]
[33127,"D","Gesa","Blechert","MGC Olympia Kiel","","","","","","","Miniaturgolfclub Olympia Kiel e. V."]
[52084,"Sw 2","Gabriele","Blechert","MGC Olympia Kiel","","","","","","","Miniaturgolfclub Olympia Kiel e. V."]
[42234,"Sm 2","Gerhard","Blechschmidt","NMC Kelheim","","","","","","","1. Niederbayerischer Minigolf-Club Kelheim e. V."]
[42233,"Sw 2","Renate","Blechschmidt","NMC Kelheim","","","","","","","1. Niederbayerischer Minigolf-Club Kelheim e. V."]
[31333,"D","Stefanie","Blendermann","MGC Mainz","","","","","","","Erster Mainzer Minigolf-Club e. V. 1964"]
[28040,"Sm 2","Werner","Bless","BSV Ohlsbach","","","","","","","Bahnengolfsportverein 82 Ohlsbach e. V."]
[28041,"Sw 2","Daniela","Bless","BSV Ohlsbach","","","","","","","Bahnengolfsportverein 82 Ohlsbach e. V."]
[47493,"Sm 1","Achim","Blessing","MGC Schwaikheim","","","","","","","Miniaturgolf – Club Schwaikheim e. V."]
[37103,"H","Tim","Blöcker","MSK Neheim-Hüsten","","","","","","","MINIGOLF-SPORT-KLUB Neheim-Hüsten e. V."]
[34063,"Sm 2","Bernhard","Blöckl","MGC München","","","","","","","1. Miniaturgolfclub München-Feldmoching e. V."]
[50681,"D","Bettina","Blömker","BGV Bergisch Land","","","","","","","Bahnengolf-Verein Bergisch Land 1962/63 e. V."]
[2275,"Sm 1","Detlev","Blume","MSV Bad Münder/Springe","Ja","","","","","","Minigolf Sport-Verein Bad Münder/Springe von 2005 e. V."]
[66049,"H","Severin","Blümer","SG Arheilgen","","","","","","","Sportgemeinschaft Arheilgen 1876/1945 e. V. Abteilung Bahnengolf"]
[66391,"Sm 2","Hardy","Blumhoff","SV Dreieichenhain","","","","","","","Sportverein 1890 e. V. Dreieichenhain Abteilung Bahnengolf"]
[43555,"Sm 1","Jens","Bock","SV Lurup","","","","","","","Sportverein Lurup-Hamburg von 1923 e. V. Abteilung Bahnengolf"]
[43782,"Sm 1","Hans-Jochen","Boenisch","BGC Northeim","Ja",18185,"","X","","X","Bahnen-Golf-Club Northeim e. V."]
[21681,"Sm 2","Volker","Bogdahn","MC Lüdenscheid","","","","","","","MC 62 Lüdenscheid e. V."]
[67113,"Sm 1","Ulrich","Bohle","MC Gelsenkirchen","","","","","","","1. Minigolf Club Gelsenkirchen e. V."]
[67172,"Sm 2","Hans-Dieter","Bohleber","BSV Ohlsbach","","","","","","","Bahnengolfsportverein 82 Ohlsbach e. V."]
[67834,"Schm","David","Böhm","SG Weiterstadt","","","","","","","Sportgemeinde 1886 e. V. Weiterstadt Abteilung Bahnengolf"]
[18421,"Sm 2","Ernst","Böhm","MGC Murnau","","","","","","","Minigolfclub Murnau am Staffelsee e. V."]
[5964,"Sm 2","Wolfgang","Bojack","MGC Würzburg","","","","","","","Miniaturgolfsportverein Würzburg - Löwenbrücke e. V."]
[66315,"Sm 1","Richard","Bölle","Kölner MC","","","","","","","Kölner Miniatur Golf Club e. V."]
[40384,"D","Anne","Bollrich","MGC Dormagen-Brechten","","","","","","","Minigolfclub Dormagen - Brechten e. V."]
[65740,"Sw 1","Margit","Bollrich","BGC Leipzig","","","","","","","1. Bahnen Golf Club Leipzig e. V."]
[38537,"Sm 2","Jens","Bollrich","BGC Leipzig","","","","","","","1. Bahnen Golf Club Leipzig e. V."]
[36329,"H","Tobias","Boltze","BGV Rodalben","","","","","","","1. Bahnengolfverein Rodalben 1977 e. V."]
[25581,"Sm 2","Uwe","Boltze","BGV Rodalben","","","","","","","1. Bahnengolfverein Rodalben 1977 e. V."]
[25578,"Sw 2","Kornelia","Boltze","BGV Rodalben","","","","","","","1. Bahnengolfverein Rodalben 1977 e. V."]
[38176,"Sm 2","Wolfgang","Bomblies","MGC Witten","","","","","","","Minigolfclub \"AS\" Witten 1963 e. V."]
[67592,"D","Janina","Bommer","BGC Bochum","","","","","","","Bahnengolf-Sportclub Bochum 1978 e. V."]
[67484,"Sm 1","Michael","Bommer","BGC Bochum","","","","","","","Bahnengolf-Sportclub Bochum 1978 e. V."]
[21702,"Sm 1","Frank","Bonenberger","MGC Ludwigshafen","","","","","","","1. Miniatur-Golf-Club Ludwigshafen 1964 e. V."]
[36323,"H","Patrick","Bönsch","KGC Bad Urach","","","","","","","Klein-Golf-Club Bad Urach e. V."]
[41663,"Sw 1","Heidi","Bönsch","KGC Bad Urach","","","","","","","Klein-Golf-Club Bad Urach e. V."]
[41667,"Sm 2","Jürgen","Bönsch","KGC Bad Urach","","","","","","","Klein-Golf-Club Bad Urach e. V."]
[41671,"Sm 2","Roland","Bönsch","KGC Bad Urach","","","","","","","Klein-Golf-Club Bad Urach e. V."]
[46859,"Sm 1","Thomas","Boock","MGC Olympia Kiel","","","","","","","Miniaturgolfclub Olympia Kiel e. V."]
[37249,"Sw 2","Cornelia","Boock","MSC Bensheim-Auerbach","","","","","","","Minigolf-Sport-Club Bensheim-Auerbach e. V."]
[66946,"H","Pascal","Börger","VfB Osnabrück","","","","","","","Verein für Bahnengolf Osnabrück von 1984 e. V."]
[66945,"Sm 1","Jens","Börger","VfB Osnabrück","","","","","","","Verein für Bahnengolf Osnabrück von 1984 e. V."]
[67470,"Sw 1","Marion","Borgers","Essener CGC","","","","","","","1. Essener cobiGOLF - Club \"Blau-Gold\" e. V."]
[43756,"H","Jens","Borggraefe","MGC Ludwigshafen","","","","","","","1. Miniatur-Golf-Club Ludwigshafen 1964 e. V."]
[36624,"D","Martina","Borggraefe","MSK Neheim-Hüsten","","","","","","","MINIGOLF-SPORT-KLUB Neheim-Hüsten e. V."]
[10087,"Sm 2","Gert","Bork","MSC Wesel","","","","","","","1. Minigolf-Sportclub Wesel 66 66 e. V. "]
[34108,"Sw 2","Elisabeth","Bork","MSC Wesel","","","","","","","1. Minigolf-Sportclub Wesel 66 66 e. V. "]
[27803,"D","Bianca","Bornhöft","MGC Olympia Kiel","","","","","","","Miniaturgolfclub Olympia Kiel e. V."]
[38241,"Sw 2","Margit","Bornkessel","SV Lurup","","","","","","","Sportverein Lurup-Hamburg von 1923 e. V. Abteilung Bahnengolf"]
[23605,"H","Marcel","Bort","BGC Heilbronn","","","","","","","Bahnengolf Club Heilbronn e. V."]
[49091,"Sm 2","Thomas","Bort","BGC Heilbronn","","","","","","","Bahnengolf Club Heilbronn e. V."]
[49092,"Sw 2","Elke","Bort","BGC Heilbronn","","","","","","","Bahnengolf Club Heilbronn e. V."]
[66066,"Sm 2","Joachim","Bosse","MGC Bad Salzuflen","","","","","","","Minigolf-Club Bad Salzuflen e. V."]
[45560,"H","Patrick","Bothmann","MGC Dormagen-Brechten","","","","","","","Minigolfclub Dormagen - Brechten e. V."]
[35737,"D","Jasmin","Bothmann",{"$f":"VLOOKUP(L322,Kurznamen,2,0)","v":"MGC Göttingen"},{"$f":"IF(VLOOKUP(L322,Kurznamen,3,0)=\"Ja\",\"Ja\",\"\")","v":"Ja"},"","","","","","1. Miniatur-Golfsport-Club 1970 Göttingen e. V."]
[46348,"Sm 1","Andreas","Bott","MGC Sulzfeld","","","","","","","Miniatur Golf Club Sulzfeld e. V."]
[32231,"H","Steven","Böttcher","MGC Göttingen","Ja",10869,"X","","","","1. Miniatur-Golfsport-Club 1970 Göttingen e. V."]
[3602,"Sm 2","Wilhelm","Böttcher","VfB Osnabrück","","","","","","","Verein für Bahnengolf Osnabrück von 1984 e. V."]
[67378,"H","Youri","Bottenberg","NDE Miniaturgolf","","","","","","","Niendorfer Miniaturgolf-Club von 1963 e. V."]
[67602,"D","Carolin","Boysen","MC Elmshorn","","","","","","","Minigolf-Club Flora Elmshorn e. V."]
[67134,"Sm 2","Saban","Bozkurt","MGC Heringen","","","","","","","Miniatur-Golf-Club Heringen e. V."]
[47419,"Sm 2","Roland","Brack","BSV Ohlsbach","","","","","","","Bahnengolfsportverein 82 Ohlsbach e. V."]
[66229,"H","Jannick","Bracken","MGC Wertheim","","","","","","","Minigolfdub Wertheim ´91 e. V."]
[38110,"H","Cedric","Brakhage","MGC Paderborn","","","","","","","1. Minigolf-Club Paderborn 1980 e. V."]
[45769,"Sm 1","Markus","Brand","MSV Bad Kreuznach","","","","","","","MSV Bad Kreuznach e. V."]
[62193,"Sm 2","Wilhelm","Brand","BGC Paderborn","","","","","","","1. Bahnengolfclub Paderborn e. V."]
[4611,"Sw 2","Ursula","Brand","BGC Paderborn","","","","","","","1. Bahnengolfclub Paderborn e. V."]
[40419,"Sm 1","Wolfgang","Brandes","Elbhavelland","","","","","","","Elbhavelland e. V. Abteilung Minigolfsport"]
[29046,"Sm 2","Peter","Brandis","TSV Kücknitz","","","","","","","Turn - und Sportverein Kücknitz von 1911 e. V. Abteilung Bahnengolf"]
[605,"Sm 2","Michael","Brandl","BGC Heilbronn","","","","","","","Bahnengolf Club Heilbronn e. V."]
[29239,"Sm 1","Michael","Brandner","CGC Illertal","","","","","","","Cobigolfclub Illertal Kellmünz e. V."]
[67138,"D","Eva","Brandstettner","BGC Goslar","Ja","","","","","","Bahnen-Golf-Club Goslar e. V."]
[65833,"Sm 1","Uwe","Brandstettner","BGC Goslar","Ja",27415,"","X","","X","Bahnen-Golf-Club Goslar e. V."]
[28747,"Sm 1","Ralph","Brandt","Preetzer TSV","","","","","","","Preetzer Turn- und Sportverein von 1861 e. V. Abteilung Minigolf"]
[489,"Sw 1","Judith","Brandt","CGC Rauschenberg","","","","","","","Cobigolf-Club Rauschenberg e. V."]
[5165,"Sm 2","Hans-Jürgen","Brandt","BGS Hardenberg","","","","","","","BGS Hardenberg-Pötter e. V."]
[24151,"Sm 2","Tobias","Brandt","CGC Rauschenberg","","","","","","","Cobigolf-Club Rauschenberg e. V."]
[65645,"H","Felix","Braschler","MGC Hechingen","","","","","","","1. Minigolfclub Hechingen e. V."]
[65644,"Sw 1","Carola","Braschler","MGC Hechingen","","","","","","","1. Minigolfclub Hechingen e. V."]
[33954,"Sm 1","Andreas","Brassait","SC Neumünster","","","","","","","Sportclub Gut Heil Neumünster von 1881 e. V. Abteilung Miniaturgolf"]
[67410,"Sm 2","Dankmar","Braucks","MSF Brilon","","","","","","","Minigolfsportfreunde Brilon e. V."]
[30395,"H","Markus","Bräuer","MGC Marl","","","","","","","Mini Golf Club Marl 1960 e. V."]
[51380,"D","Diana","Bräuer","MGC Marl","","","","","","","Mini Golf Club Marl 1960 e. V."]
[37557,"Sw 2","Ute","Bräuer","MGC Marl","","","","","","","Mini Golf Club Marl 1960 e. V."]
[65866,"D","Jette","Braun","MGC Olympia Kiel","","","","","","","Miniaturgolfclub Olympia Kiel e. V."]
[67617,"Schw","Wiebke","Braun","BGSC Gladbeck","","","","","","","Bahnengolfsportclub \"Gut Schlag\" Gladbeck e. V."]
[29547,"Sm 1","Thorsten","Braun","MGC Olympia Kiel","","","","","","","Miniaturgolfclub Olympia Kiel e. V."]
[41465,"Sm 1","Wolfram","Braun","MGC Göttingen","Ja","","","","","","1. Miniatur-Golfsport-Club 1970 Göttingen e. V."]
[67188,"Sm 1","Dierk","Braun","BGSC Gladbeck","","","","","","","Bahnengolfsportclub \"Gut Schlag\" Gladbeck e. V."]
[66847,"Sm 2","Gerd","Braun","BGC Uerdingen","","","","","","","Bahnengolf-Club Uerdingen e. V."]
[35365,"Sw 2","Elisabeth","Braun","MGC Mannheim","","","","","","","1. Miniatur-Golf-Club Mannheim 1968 e. V."]
[65752,"Sw 2","Gabriele","Braun","MSK Olching","","","","","","","Olchinger Minigolf Sport Klub e. V."]
[16823,"H","Achim","Braungart Zink","SG Arheilgen","","","","","","","Sportgemeinschaft Arheilgen 1876/1945 e. V. Abteilung Bahnengolf"]
[50717,"Sw 2","Ursula","Braungart Zink","MGU Neviges","","","","","","","Minigolfunion Neviges-Odenthal 1968 e. V."]
[66418,"Sm 2","Bert","Brause","SC Dortmund","","","","","","","Sport-Club Olympia Dortmund e. V. "]
[46813,"Sm 1","Manfred","Brechelt","MGC Göttingen","Ja","","","","","","1. Miniatur-Golfsport-Club 1970 Göttingen e. V."]
[34812,"H","Benjamin","Brechtel","MGC Ravensburg","","","","","","","MGC Ravensburg-Weingarten e. V."]
[26565,"Sm 2","Kurt","Breckenkamp","MC Künsebeck","","","","","","","Miniaturgolf Club Tigers Künsebeck e. V."]
[44743,"Sm 1","Stefan","Bredel","MGC Würzburg","","","","","","","Miniaturgolfsportverein Würzburg - Löwenbrücke e. V."]
[38567,"D","Anika","Breidenbach","MGC Bergisch Gladbach","","","","","","","Minigolf-Club Bergisch Gladbach Gierath e. V."]
[50409,"Sw 2","Maritta","Breier","MGV Ansbach","","","","","","","MGV Ansbach e. V."]
[67751,"D","Miriam","Breitbach","MGC Bergisch Gladbach","","","","","","","Minigolf-Club Bergisch Gladbach Gierath e. V."]
[37260,"Sm 2","Jürgen","Breitbach","BGC Dormagen","","","","","","","Bahnengolf-Club Dormagen e. V."]
[37867,"Sw 2","Lydia","Breitbach","BGC Dormagen","","","","","","","Bahnengolf-Club Dormagen e. V."]
[67219,"Sm 1","Frank","Breitbarth","SC Dortmund","","","","","","","Sport-Club Olympia Dortmund e. V. "]
[67185,"Sm 1","Johannes","Breitfeld","MSG Kempten","","","","","","","Minigolf-Sport-Gemeinschaft Kempten e. V."]
[36420,"Sm 1","Thomas","Breitkopf","MGC Hechingen","","","","","","","1. Minigolfclub Hechingen e. V."]
[36939,"H","Alexander","Breitling","BGC Bad Berneck","","","","","","","Bahnengolf-Club e. V. Bad Berneck"]
[31619,"Sm 1","Dieter","Breitling","BGC Bad Berneck","","","","","","","Bahnengolf-Club e. V. Bad Berneck"]
[66903,"Jm","H. Paul","Bremer","MC Lüdenscheid","","","","","","","MC 62 Lüdenscheid e. V."]
[36697,"Sm 1","H. Bernd","Bremer","KGC Mönchengladbach","","","","","","","1. Klein-Golf-Club Mönchengladbach e. V."]
[31074,"Sm 1","Stephan","Bremicker","MGC Dormagen-Brechten","","","","","","","Minigolfclub Dormagen - Brechten e. V."]
[42970,"Sw 1","Susanne","Bremicker","MGC Dormagen-Brechten","","","","","","","Minigolfclub Dormagen - Brechten e. V."]
[66531,"Sm 1","Robert","Brendel","MGC Bamberg","","","","","","","1. Minigolfclub Bamberg e. V."]
[87505,"H","Steffen","Brendler","MGC Göttingen","Ja","","","","","","1. Miniatur-Golfsport-Club 1970 Göttingen e. V."]
[49753,"Sw 2","Monika","Brethack","BGC Kiel-West","","","","","","","Bahnen-Golf-Club Kiel-West e. V."]
[67801,"Schm","Tim","Bretschneider","MGC Wanne-Eickel","","","","","","","Minigolfclub Rot-Weiß Wanne-Eickel e. V."]
[37121,"Sm 2","Werner","Briese","MGC Wanne-Eickel","","","","","","","Minigolfclub Rot-Weiß Wanne-Eickel e. V."]
[35751,"Sm 1","Thorsten","Brille",{"$f":"VLOOKUP(L386,Kurznamen,2,0)","v":"BGV Backumer Tal"},{"$f":"IF(VLOOKUP(L386,Kurznamen,3,0)=\"Ja\",\"Ja\",\"\")","v":""},"","","","","","BGV Backumer Tal Herten e. V."]
[67448,"Sm 1","Christoph","Brinkmann","VfL Lohbrügge","","","","","","","Verein für Leibesübungen Lohbrügge von 1892 e. V. Abteilung Bahnengolf"]
[44142,"Sm 2","Karl-Heinz","Britte","MGC Heven","","","","","","","Miniatur - Golf - Club Heven e. V."]
[36204,"H","Gerrit","Britz","KC Homburg","","","","","","","1. Kleingolf Club Homburg-Saar 1967 e. V."]
[38492,"H","Marcel","Brocks","BGS Hardenberg","","","","","","","BGS Hardenberg-Pötter e. V."]
[38316,"Sm 1","Ralf","Brocks","BGS Hardenberg","","","","","","","BGS Hardenberg-Pötter e. V."]
[38336,"Sm 1","Carsten","Brocks","BGS Hardenberg","","","","","","","BGS Hardenberg-Pötter e. V."]
[66518,"Sm 1","Knut","Brodersen","MGC Brunsbüttel","","","","","","","Miniaturgolf-Club Brunsbüttel e. V."]
[3185,"Sm 2","Josef","Brodesser","Kölner MC","","","","","","","Kölner Miniatur Golf Club e. V."]
[66101,"Sw 1","Bettina","Brökemeier","MGC Bad Salzuflen","","","","","","","Minigolf-Club Bad Salzuflen e. V."]
[33081,"H","Michael","Bromberger","BSV Ohlsbach","","","","","","","Bahnengolfsportverein 82 Ohlsbach e. V."]
[29739,"Sm 1","Jörg","Brommer","TG Höchberg","","","","","","","Turngemeinde Höchberg von 1862 Bahnengolf e. V."]
[37051,"Sw 2","Viola","Bronsart","TV Trappenkamp","","","","","","","Turnverein Trappenkamp e. V. Sparte Minigolf"]
[36780,"H","Christopher","Brown","VfM Berlin","","","","","","","Verein für Minigolf e. V. Berlin"]
[29085,"Sm 1","Lars","Brüchert","MGC Mainz","","","","","","","Erster Mainzer Minigolf-Club e. V. 1964"]
[67303,"H","Rouven","Bruelheide","MGC Bad Salzuflen","","","","","","","Minigolf-Club Bad Salzuflen e. V."]
[66534,"H","Julian","Brune","Rot-Weiß Syburg","","","","","","","Rot-Weiß Syburg 1960 e. V."]
[26815,"Sm 1","Lutz","Brune","MGC Ludwigshafen","","","","","","","1. Miniatur-Golf-Club Ludwigshafen 1964 e. V."]
[31524,"Sm 1","Christoph","Brune","Rot-Weiß Syburg","","","","","","","Rot-Weiß Syburg 1960 e. V."]
[67675,"Sm 1","Axel","Brünger","MGC Bad Salzuflen","","","","","","","Minigolf-Club Bad Salzuflen e. V."]
[46236,"Sm 1","Ralf","Brunner","MSC Bad Godesberg","","","","","","","Minigolf-Sport-Club Bad Godesberg e. V."]
[34566,"H","Wolf","Bublitz","BGC Bochum","","","","","","","Bahnengolf-Sportclub Bochum 1978 e. V."]
[67103,"D","Julia","Bublitz","BGC Bochum","","","","","","","Bahnengolf-Sportclub Bochum 1978 e. V."]
[42777,"Sm 1","Marcus","Bublitz","MGC Ludwigshafen","","","","","","","1. Miniatur-Golf-Club Ludwigshafen 1964 e. V."]
[22165,"Sm 2","Harald","Buchert","MSC Bensheim-Auerbach","","","","","","","Minigolf-Sport-Club Bensheim-Auerbach e. V."]
[31317,"D","Jennifer","Buchholz","TV Trappenkamp","","","","","","","Turnverein Trappenkamp e. V. Sparte Minigolf"]
[31513,"Sm 1","Ansgar","Buchholz","MGC Witten","","","","","","","Minigolfclub \"AS\" Witten 1963 e. V."]
[41296,"Sm 2","Uwe","Buchholz","Preetzer TSV","","","","","","","Preetzer Turn- und Sportverein von 1861 e. V. Abteilung Minigolf"]
[41297,"Sm 2","Werner","Buchholz","TV Trappenkamp","","","","","","","Turnverein Trappenkamp e. V. Sparte Minigolf"]
[65819,"Sm 2","Horst","Buchner","BSC Ennepetal","","","","","","","Bahngolf-Sport-Club Ennepetal e. V."]
[67229,"Schm","Luis","Buchwieser","MSK Olching","","","","","","","Olchinger Minigolf Sport Klub e. V."]
[67399,"Schm","Carl","Buchwieser","MSK Olching","","","","","","","Olchinger Minigolf Sport Klub e. V."]
[38056,"Sm 2","Felix","Buckentin","MGC Ingolstadt","","","","","",""," Miniaturgolf-Club Ingolstadt e. V."]
[67639,"H","Alexander","Bucksch","MGC Bergisch Gladbach","","","","","","","Minigolf-Club Bergisch Gladbach Gierath e. V."]
[67638,"Sw 1","Francoise","Bucksch","MGC Bergisch Gladbach","","","","","","","Minigolf-Club Bergisch Gladbach Gierath e. V."]
[29327,"Sm 1","Markus","Büdenbender","MSC Wesel","","","","","","","1. Minigolf-Sportclub Wesel 66 66 e. V. "]
[34106,"Sm 2","Dietmar","Bühner","MGC Nümbrecht","","","","","","","Minigolf-Club Nümbrecht e. V. "]
[32844,"D","Ricarda","Bundtzen","Essener CGC","","","","","","","1. Essener cobiGOLF - Club \"Blau-Gold\" e. V."]
[34974,"H","Paul","Bunse","BGC Paderborn","","","","","","","1. Bahnengolfclub Paderborn e. V."]
[44445,"Sm 1","Oliver","Burde","VfM Bottrop","","","","","","","Verein für Minigolf Bottrop e. V."]
[38584,"H","Yannick","Burdorf","MC Künsebeck","","","","","","","Miniaturgolf Club Tigers Künsebeck e. V."]
[5758,"Sm 2","Jürgen","Burgard","FZC Bliesen","","","","","","","Freizeit Club Bliesen e. V."]
[38436,"Jm","Norman","Burgdorf","SV Gebhardshagen","Ja","","","","","","SV Glück Auf 1901 Gebhardshagen e. V. Abteilung Minigolf"]
[40281,"Sm 1","Harald","Burger","MGC Ludwigshafen","","","","","","","1. Miniatur-Golf-Club Ludwigshafen 1964 e. V."]
[45219,"Sm 1","Michael","Burk","MSC Bensheim-Auerbach","","","","","","","Minigolf-Sport-Club Bensheim-Auerbach e. V."]
[65508,"Sm 2","Dieter","Burkart","BSV Inzlingen","","","","","","","Bahnengolf-Sportverein Inzlingen 1979 e. V."]
[67576,"Jm","Kevin","Burkert","NDE Miniaturgolf","","","","","","","Niendorfer Miniaturgolf-Club von 1963 e. V."]
[67575,"Sm 1","Peter","Burkert","NDE Miniaturgolf","","","","","","","Niendorfer Miniaturgolf-Club von 1963 e. V."]
[38135,"Sw 1","Sabine Monika","Burkert","MGF Magdeburg","","","","","","","Minigolffreunde Magdeburg e. V."]
[1951,"Sm 2","Michael","Burkert","MGF Magdeburg","","","","","","","Minigolffreunde Magdeburg e. V."]
[34305,"Sw 2","Renate","Burkert","MGV Bremen","Ja","","","","","","Miniatur-Golf-Verein Bremen e. V."]
[43821,"Sm 2","Peter","Burkhart","MSV Bad Kreuznach","","","","","","","MSV Bad Kreuznach e. V."]
[44916,"Sw 2","Roswitha","Burkhart","MSV Bad Kreuznach","","","","","","","MSV Bad Kreuznach e. V."]
[29268,"Sm 2","Manfred","Burmeister","MGC Brunsbüttel","","","","","","","Miniaturgolf-Club Brunsbüttel e. V."]
[19315,"Sm 2","Wolfgang","Burmester","MGC Bad Oldesloe","","","","","","","Miniaturgolfclub Bad Oldesloe von 1964 e. V."]
[46026,"Sm 1","Michael","Busch","BGC Goslar","Ja",19553,"","X","","","Bahnen-Golf-Club Goslar e. V."]
[45253,"Sw 1","Simona","Busch","BGC Goslar","Ja",19072,"","X","","","Bahnen-Golf-Club Goslar e. V."]
[10586,"Sm 2","Philip","Busche","MGC Göttingen","Ja",5463,"X","","","","1. Miniatur-Golfsport-Club 1970 Göttingen e. V."]
[67451,"Sw 2","Petra","Büschenfeldt","VfL Lohbrügge","","","","","","","Verein für Leibesübungen Lohbrügge von 1892 e. V. Abteilung Bahnengolf"]
[3990,"Sm 2","Rolf","Büscher","MGC Heven","","","","","","","Miniatur - Golf - Club Heven e. V."]
[66814,"H","Daniel","Buser","MGC Unterschneidheim","","","","","","","Minigolfclub Unterschneidheim e. V."]
[66328,"Sm 1","Peter","Büsgen","Kölner MC","","","","","","","Kölner Miniatur Golf Club e. V."]
[33859,"H","Patrick","Buske","MC Künsebeck","","","","","","","Miniaturgolf Club Tigers Künsebeck e. V."]
[33860,"H","Pascal","Buske","MC Künsebeck","","","","","","","Miniaturgolf Club Tigers Künsebeck e. V."]
[37600,"Sm 2","Erwin","Butscher",{"$f":"VLOOKUP(L450,Kurznamen,2,0)","v":"BGC Dormagen"},{"$f":"IF(VLOOKUP(L450,Kurznamen,3,0)=\"Ja\",\"Ja\",\"\")","v":""},"","","","","","Bahnengolf-Club Dormagen e. V."]
[33659,"H","Alexander","Büttner","MGF Hammer","","","","","","","Minigolffreunde Hammer e. V."]
[40888,"H","Torben","Bychowski","MC Elmshorn","","","","","","","Minigolf-Club Flora Elmshorn e. V."]
[5015,"Sm 2","Raffaele","Canceniella","MC Schriesheim","","","","","","","Miniaturgolf Sportclub Schriesheim e. V."]
[67441,"Sm 1","Franco","Cappelletti","MGC Mainz","","","","","","","Erster Mainzer Minigolf-Club e. V. 1964"]
[37789,"Sm 2","Gerhard","Caspar","MGC Mainz","","","","","","","Erster Mainzer Minigolf-Club e. V. 1964"]
[67171,"Sw 1","Marina","Casu","MGC Ingolstadt","","","","","",""," Miniaturgolf-Club Ingolstadt e. V."]
[66852,"Sm 1","Andree","Cech","BSV Asslar","","","","","","","Bahnengolf-Sportverein Aßlar 1987 e. V."]
[67048,"H","Marc","Cervinca","BGC Bad Füssing","","","","","","","1. Bahnengolfclub Bad Füssing e. V."]
[66543,"Sm 2","Bernd","Chabowski","MGV Bremen","Ja","","","","","","Miniatur-Golf-Verein Bremen e. V."]
[67482,"H","Jakub","Ches","MGC Harrislee","","","","","","","Sportverein Minigolfclub Harrislee-Wassersleben e. V."]
[40415,"Sm 1","Oliver","Christ","NDE Miniaturgolf","","","","","","","Niendorfer Miniaturgolf-Club von 1963 e. V."]
[44409,"Sm 1","Daniel","Christ","MGC Olympia Kiel","","","","","","","Miniaturgolfclub Olympia Kiel e. V."]
[46852,"Sm 2","Michael","Christ","MGC Brunsbüttel","","","","","","","Miniaturgolf-Club Brunsbüttel e. V."]
[35102,"D","Ramona","Christiansen","MC Elmshorn","","","","","","","Minigolf-Club Flora Elmshorn e. V."]
[65894,"Sm 2","Thomas","Christmann","BGC Bildstock","","","","","","","Bahnen-Golf-Club Bildstock e. V."]
[65895,"Sw 2","Steffi","Christmann","BGC Bildstock","","","","","","","Bahnen-Golf-Club Bildstock e. V."]
[36650,"Sm 2","Gerhard","Chrobock","MGC Einbeck","Ja","","","","","","Miniatur-Golf-Club Einbeck e. V."]
[67385,"Sw 2","Marion","Ciachera","MC Rheinhausen","","","","","","","1. Minigolf-Club Rheinhausen e. V."]
[66086,"Sm 2","Edmund","Cieslik","BGC Celle","Ja","","","","","","1. Bahnen-Golf-Club Celle von 1964 e. V."]
[12431,"Sw 2","Marlies","Citi","KGC Frankfurt","","","","","","","Kleingolfclub Waldstadion e. V. Frankfurt am Main\t"]
[40407,"Sm 1","Tim","Clasen","MSC Wesel","","","","","","","1. Minigolf-Sportclub Wesel 66 66 e. V. "]
[48980,"Sm 1","Jan","Clemens","MGC Marl","","","","","","","Mini Golf Club Marl 1960 e. V."]
[45741,"Sw 1","Isabella","Clemens","MGC Marl","","","","","","","Mini Golf Club Marl 1960 e. V."]
[36581,"Sw 1","Kirsten","Clever","MC Möve Cuxhaven","Ja","","","","","","Miniaturgolf-Club \"Möve\" Cuxhaven-Sahlenburg e. V."]
[66336,"Sm 2","Herbert","Cöln","BGC Paffendorf","","","","","","","Bahnengolf Club Schloß Paffendorf e. V."]
[67129,"Sw 2","Gertrud","Cöln","BGC Paffendorf","","","","","","","Bahnengolf Club Schloß Paffendorf e. V."]
[66491,"Sm 1","Marco","Corinth","MC Gelsenkirchen","","","","","","","1. Minigolf Club Gelsenkirchen e. V."]
[34137,"D","Claudia","Crass","Rot-Weiß Syburg","","","","","","","Rot-Weiß Syburg 1960 e. V."]
[34693,"Sw 2","Annegret","Crass","HMC Büttgen","","","","","","","Hobbysport Miniaturgolfclub Büttgen e. V."]
[65843,"H","Yannick","Crettat","MGC Bad Homburg","","","","","","","Minigolf-Club Bad Homburg e. V."]
[44877,"Sm 1","Harm","Croppenstedt","Tempelhofer MV","","","","","","","Tempelhofer Miniaturgolf Verein von 1965 e. V."]
[44760,"Sw 2","Ursula","Crößmann","MGC Ludwigshafen","","","","","","","1. Miniatur-Golf-Club Ludwigshafen 1964 e. V."]
[67634,"Schm","Jannis","Cvijanovic","SSC Attendorn","","","","","","","Sterngolf-Sport-Club Attendorn e. V."]
[49136,"Sm 1","Michael","Czernoch","MSC München","","","","","","","Minigolf-Sport-Club blau-weiß 2003 e. V. München"]
[21335,"Sm 2","Hans-Dirk","Czerwek","MSC Bensheim-Auerbach","","","","","","","Minigolf-Sport-Club Bensheim-Auerbach e. V."]
[67526,"Sm 1","Achim","Czerwinski","SC Dortmund","","","","","","","Sport-Club Olympia Dortmund e. V. "]
[38448,"H","Tim","Dachwald","SV Lurup","","","","","","","Sportverein Lurup-Hamburg von 1923 e. V. Abteilung Bahnengolf"]
[49479,"Sm 1","Andreas","Dageförde","MGC Metzingen","","","","","","","1. Miniaturgolf Club Metzingen e. V."]
[37817,"D","Denise","Dahl","CGC Hamm","","","","","","","Cobigolf-Verein Hamm 2019 e. V."]
[9710,"Sm 1","Roland","Dahl","KC Homburg","","","","","","","1. Kleingolf Club Homburg-Saar 1967 e. V."]
[67811,"H","Richard","Dahmen","BGSC Gladbeck","","","","","","","Bahnengolfsportclub \"Gut Schlag\" Gladbeck e. V."]
[66399,"Sm 2","Matthias","Dahrendorf","SV Lurup","","","","","","","Sportverein Lurup-Hamburg von 1923 e. V. Abteilung Bahnengolf"]
[66398,"Sw 2","Petra","Dahrendorf","SV Lurup","","","","","","","Sportverein Lurup-Hamburg von 1923 e. V. Abteilung Bahnengolf"]
[67263,"Schm","Mazen","Dallah","TSV Kücknitz","","","","","","","Turn - und Sportverein Kücknitz von 1911 e. V. Abteilung Bahnengolf"]
[66729,"H","Christian","Damaschke","MGV Bremen","Ja","","","","","","Miniatur-Golf-Verein Bremen e. V."]
[25732,"Sm 2","Reinhold","Dammann","MGC Witten","","","","","","","Minigolfclub \"AS\" Witten 1963 e. V."]
[30625,"Sm 1","Andreas","Dams","MGC Felderbachtal","","","","","","","Minigolf-Club-Felderbachtal 1964 e. V."]
[65441,"Sw 1","Tanja","Dams","MGC Felderbachtal","","","","","","","Minigolf-Club-Felderbachtal 1964 e. V."]
[45297,"Sm 2","Michael","Dassek","SC Dortmund","","","","","","","Sport-Club Olympia Dortmund e. V. "]
[33194,"Sm 1","Jürgen","Daub","MC Schriesheim","","","","","","","Miniaturgolf Sportclub Schriesheim e. V."]
[67052,"H","Max Werner","Daumann","FMGC Lichtenfels","","","","","","","1. Fränkischer Minigolfclub Lichtenfels 1961 e. V."]
[33904,"Sm 1","Thomas","Dautert","BGV Backumer Tal","","","","","","","BGV Backumer Tal Herten e. V."]
[67768,"Jm","Tim","de Boer","NDE Miniaturgolf","","","","","","","Niendorfer Miniaturgolf-Club von 1963 e. V."]
[36109,"D","Sabine","Deck","SG Arheilgen","","","","","","","Sportgemeinschaft Arheilgen 1876/1945 e. V. Abteilung Bahnengolf"]
[40091,"Sw 2","Monika","Deck","SG Arheilgen","","","","","","","Sportgemeinschaft Arheilgen 1876/1945 e. V. Abteilung Bahnengolf"]
[48691,"Sm 1","Jochen","Dedeleit","MGC Friedrichshafen","","","","","","","Miniaturgolfclub Friedrichshafen e. V."]
[37856,"H","Martin","Deeg","MGC Unterschneidheim","","","","","","","Minigolfclub Unterschneidheim e. V."]
[43691,"Sm 1","Thomas","Deepen","BGC Goslar","Ja","","","","","","Bahnen-Golf-Club Goslar e. V."]
[33673,"Sm 2","Joachim","Dehne","BGC Paderborn","","","","","","","1. Bahnengolfclub Paderborn e. V."]
[66969,"H","Benjamin","Deicke","BGC Hannover","Ja","","","","","","1. Bahnen-Golf-Club Hannover e. V."]
[40916,"Sm 1","Stefan","Deider","Reinickendorfer MGC","","","","","","","Reinickendorfer Miniatur - Golfsport - Club e. V."]
[64989,"H","Rene","Dejoks","BGC Diepholz","Ja",24675,"","X","","X","Bahnen-Golf-Club Diepholz e. V."]
[66016,"Sm 1","Christian","Delasbe","MSG Kempten","","","","","","","Minigolf-Sport-Gemeinschaft Kempten e. V."]
[66055,"Sw 1","Barbara","Delasbe",{"$f":"VLOOKUP(L514,Kurznamen,2,0)","v":"MSG Kempten"},{"$f":"IF(VLOOKUP(L514,Kurznamen,3,0)=\"Ja\",\"Ja\",\"\")","v":""},"","","","","","Minigolf-Sport-Gemeinschaft Kempten e. V."]
[6264,"Sm 2","Karl-Heinz","Dellinger","MSC Bensheim-Auerbach","","","","","","","Minigolf-Sport-Club Bensheim-Auerbach e. V."]
[21501,"Sm 2","Christoph","Dellmann","MSK Neheim-Hüsten","","","","","","","MINIGOLF-SPORT-KLUB Neheim-Hüsten e. V."]
[66452,"Sm 1","Marko","Depke","MGC Bad Salzuflen","","","","","","","Minigolf-Club Bad Salzuflen e. V."]
[10759,"Sm 2","Wolfgang","Detering","MGC Bad Salzuflen","","","","","","","Minigolf-Club Bad Salzuflen e. V."]
[32810,"Sm 2","Heinz-Werner","Detlof","BGC Hannover","Ja","","","","","","1. Bahnen-Golf-Club Hannover e. V."]
[33311,"Sw 2","Maren","Detlof","BGC Hannover","Ja",11420,"","","","X","1. Bahnen-Golf-Club Hannover e. V."]
[196,"Sm 1","Peter","Dettmer","VfB Osnabrück","","","","","","","Verein für Bahnengolf Osnabrück von 1984 e. V."]
[66085,"H","Erik","Dettmer-Melendez","MC Künsebeck","","","","","","","Miniaturgolf Club Tigers Künsebeck e. V."]
[38478,"H","Philip","Deutschmann","MGC Göttingen","Ja","","","","","","1. Miniatur-Golfsport-Club 1970 Göttingen e. V."]
[42308,"Sm 1","Uwe","Dewor","KGC Bad Urach","","","","","","","Klein-Golf-Club Bad Urach e. V."]
[67349,"Sm 2","Alfons","Dhombruch","MGC Ludwigshafen","","","","","","","1. Miniatur-Golf-Club Ludwigshafen 1964 e. V."]
[67350,"Sw 2","Verena","Dhombruch","MGC Ludwigshafen","","","","","","","1. Miniatur-Golf-Club Ludwigshafen 1964 e. V."]
[67084,"H","Stefan","Dickert","CGC Groß-Umstadt","","","","","","","1. Cobigolf Club Rot-Weiß Groß-Umstadt e. V."]
[38141,"H","Robin","Dickes","MGC Mainz","","","","","","","Erster Mainzer Minigolf-Club e. V. 1964"]
[50770,"Sm 1","Michael","Diedrich","MC Gelsenkirchen","","","","","","","1. Minigolf Club Gelsenkirchen e. V."]
[28955,"Sm 2","Rainer","Diehl","MSC Bensheim-Auerbach","","","","","","","Minigolf-Sport-Club Bensheim-Auerbach e. V."]
[66031,"H","Julian","Diener","BGC Northeim","Ja","","","","","","Bahnen-Golf-Club Northeim e. V."]
[66030,"H","Manuel","Diener","BGC Diepholz","Ja","","","","","","Bahnen-Golf-Club Diepholz e. V."]
[67111,"Sm 1","Frank","Diener","MSC Bad Godesberg","","","","","","","Minigolf-Sport-Club Bad Godesberg e. V."]
[67401,"Jm","Marcel","Dierks","MGC Georgsmarienhütte","","","","","","","Minigolf-Club Georgsmarienhütte e. V."]
[67731,"Schm","Maxim ","Dierks","MGC Georgsmarienhütte","","","","","","","Minigolf-Club Georgsmarienhütte e. V."]
[67290,"Jm","Fabian","Dietz","MGC Heringen","","","","","","","Miniatur-Golf-Club Heringen e. V."]
[5745,"Sm 2","Gerhard","Dietzel","MGC Felderbachtal","","","","","","","Minigolf-Club-Felderbachtal 1964 e. V."]
[10953,"Sw 2","Veronika","Dietzel","MGC Felderbachtal","","","","","","","Minigolf-Club-Felderbachtal 1964 e. V."]
[37963,"H","Anton","Dillinger","Tempelhofer MV","","","","","","","Tempelhofer Miniaturgolf Verein von 1965 e. V."]
[36175,"D","Anne","Dippel","VfM Bottrop","","","","","","","Verein für Minigolf Bottrop e. V."]
[34451,"Sm 1","Markus","Dippelhofer","MGC Mannheim","","","","","","","1. Miniatur-Golf-Club Mannheim 1968 e. V."]
[45139,"Sm 1","René","Dippelhofer","BSV Bad Homburg","","","","","","","Bahnengolf-Sportverein Bad Homburg v.d.H. e. V."]
[45161,"Sm 1","Christian","Dirksmeyer","MGC Epe","","","","","","","1. Minigolfclub Epe 1978 e. V."]
[63588,"H","Dennis","Dirlmeier","BGC Neutraubling","","","","","","","Bahnengolf-Club Neutraubling e. V."]
[38329,"Sm 1","Michael","Dittrich","MGC putter Künzell","","","","","","","Minigolfclub putter Künzell 1970 e. V."]
[35097,"D","Renate","Djezri","MGC Würzburg","","","","","","","Miniaturgolfsportverein Würzburg - Löwenbrücke e. V."]
[51818,"H","Tobias","Dochat","BGV Bergisch Land","","","","","","","Bahnengolf-Verein Bergisch Land 1962/63 e. V."]
[67483,"Sw 1","Stefanie","Dohm","BGC Bochum","","","","","","","Bahnengolf-Sportclub Bochum 1978 e. V."]
[42787,"Sw 1","Britta","Dohmen","BGC Uerdingen","","","","","","","Bahnengolf-Club Uerdingen e. V."]
[66868,"D","Marie-Theres","Dolch","CGC Groß-Umstadt","","","","","","","1. Cobigolf Club Rot-Weiß Groß-Umstadt e. V."]
[30207,"Sm 2","Peter","Dolch","CGC Groß-Umstadt","","","","","","","1. Cobigolf Club Rot-Weiß Groß-Umstadt e. V."]
[25887,"Sm 2","Dietmar","Dolde","MGC Metzingen","","","","","","","1. Miniaturgolf Club Metzingen e. V."]
[67199,"Sw 1","Silke","Doll","BSV Bad Homburg","","","","","","","Bahnengolf-Sportverein Bad Homburg v.d.H. e. V."]
[36907,"Sm 2","Fred","Doll","BGC Celle","Ja","","","","","","1. Bahnen-Golf-Club Celle von 1964 e. V."]
[49414,"H","Markus","Dolp","BGC Illertissen","","","","","","","Bahnengolfclub Illertissen e. V."]
[6905,"Sm 2","Heinz","Donsbach","MSC Bad Godesberg","","","","","","","Minigolf-Sport-Club Bad Godesberg e. V."]
[67783,"Sm 2","Thomas","Dörflein","MGV Ansbach","","","","","","","MGV Ansbach e. V."]
[35718,"Sw 1","Piroschka","Dorfmeister","MGC Felderbachtal","","","","","","","Minigolf-Club-Felderbachtal 1964 e. V."]
[66811,"H","Matthias","Dörheit","Elbhavelland","","","","","","","Elbhavelland e. V. Abteilung Minigolfsport"]
[44395,"Sm 1","Kai","Dorner","MGC Dormagen-Brechten","","","","","","","Minigolfclub Dormagen - Brechten e. V."]
[38012,"H","Kevin","Dornick","MGC Ludwigshafen","","","","","","","1. Miniatur-Golf-Club Ludwigshafen 1964 e. V."]
[38011,"Sm 1","Jochen","Dornick","MGC Ludwigshafen","","","","","","","1. Miniatur-Golf-Club Ludwigshafen 1964 e. V."]
[38013,"Sw 1","Zita","Dornick","MGC Ludwigshafen","","","","","","","1. Miniatur-Golf-Club Ludwigshafen 1964 e. V."]
[67779,"D","Carmen","Dorsch","SV Gebhardshagen","Ja","","","","","","SV Glück Auf 1901 Gebhardshagen e. V. Abteilung Minigolf"]
[67777,"Schm","Nico","Dorsch","SV Gebhardshagen","Ja","","","","","","SV Glück Auf 1901 Gebhardshagen e. V. Abteilung Minigolf"]
[67778,"Schw","Myra","Dorsch","SV Gebhardshagen","Ja","","","","","","SV Glück Auf 1901 Gebhardshagen e. V. Abteilung Minigolf"]
[66213,"H","Werner","Dosch","MC Ilvesheim","","","","","","","Miniaturgolf-Club Ilvesheim e. V."]
[33733,"Sm 1","Michael","Dostert","MSC Bad Godesberg","","","","","","","Minigolf-Sport-Club Bad Godesberg e. V."]
[46210,"Sw 2","Ulrike","Dowidat","MGC Köln","","","","","","","1. Minigolf-Club Köln 1961 e. V."]
[67238,"Jm","Lucas","Draber","FMGC Lichtenfels","","","","","","","1. Fränkischer Minigolfclub Lichtenfels 1961 e. V."]
[36775,"Sm 2","Horst","Drautzburg","MGU Neviges","","","","","","","Minigolfunion Neviges-Odenthal 1968 e. V."]
[37864,"Sm 1","Erich","Drebert","SG Weiterstadt","","","","","","","Sportgemeinde 1886 e. V. Weiterstadt Abteilung Bahnengolf"]
[66163,"Sw 2","Clementine","Drebert","SG Weiterstadt","","","","","","","Sportgemeinde 1886 e. V. Weiterstadt Abteilung Bahnengolf"]
[67660,"Sw 1","Christine","Drees","Tempelhofer MV","","","","","","","Tempelhofer Miniaturgolf Verein von 1965 e. V."]
[67661,"Sm 2","Holger","Drees","Tempelhofer MV","","","","","","","Tempelhofer Miniaturgolf Verein von 1965 e. V."]
[5717,"Sm 2","Hans","Dreger","SV Dreieichenhain","","","","","","","Sportverein 1890 e. V. Dreieichenhain Abteilung Bahnengolf"]
[23778,"Sm 2","Burkhard","Dreischer","SC Dortmund","","","","","","","Sport-Club Olympia Dortmund e. V. "]
[4510,"Sm 2","Manfred","Drescher",{"$f":"VLOOKUP(L578,Kurznamen,2,0)","v":"MGC Wetzlar"},{"$f":"IF(VLOOKUP(L578,Kurznamen,3,0)=\"Ja\",\"Ja\",\"\")","v":""},"","","","","","Miniatur-Golf-Club Wetzlar e. V."]
[36519,"Sm 2","Kurt","Dresel","MGC Ingolstadt","","","","","",""," Miniaturgolf-Club Ingolstadt e. V."]
[35132,"H","Daniel","Drewes","MGC putter Künzell","","","","","","","Minigolfclub putter Künzell 1970 e. V."]
[6203,"Sm 2","Horst","Dreyer","VfL Lüneburg","Ja",4862,"","X","","X","Verein für Leibesübungen Lüneburg e. V. Abteilung Bahnengolf"]
[67252,"Sm 2","Alfons","Driemel","MGC Ravensburg","","","","","","","MGC Ravensburg-Weingarten e. V."]
[65719,"Sm 2","Andreas","Drobik","BGC Bremen","Ja",27074,"X","","","","Bahnen-Golf-Club Bremen e. V."]
[65720,"Sw 2","Kerstin","Drobik","MGV Bremen","Ja","","","","","","Miniatur-Golf-Verein Bremen e. V."]
[66043,"Sm 1","Peter","Droste","BSV Bad Homburg","","","","","","","Bahnengolf-Sportverein Bad Homburg v.d.H. e. V."]
[66152,"Sm 2","Günter","Drostel","MC Rheinhausen","","","","","","","1. Minigolf-Club Rheinhausen e. V."]
[36524,"H","Sebastian","Dudenhöffer","BSV Inzlingen","","","","","","","Bahnengolf-Sportverein Inzlingen 1979 e. V."]
[43595,"Sm 2","Jürgen","Duensing","BGC Diepholz","Ja","","","","","","Bahnen-Golf-Club Diepholz e. V."]
[65469,"Sm 1","Norbert","Dullau","MC Gelsenkirchen","","","","","","","1. Minigolf Club Gelsenkirchen e. V."]
[3826,"Sm 2","Winfried","Dümmler","KC Homburg","","","","","","","1. Kleingolf Club Homburg-Saar 1967 e. V."]
[67108,"H","Michael","Dunkel","BGC Landshut","","","","","","","1. Bahnengolf-Club Landshut e. V."]
[67477,"D","Christina","Dunkelmann","BGC Oberhausen","","","","","","","Bahnengolf-Club Oberhausen e. V."]
[37832,"H","Sven","Dunker","VfB Osnabrück","","","","","","","Verein für Bahnengolf Osnabrück von 1984 e. V."]
[37750,"D","Ruth Friederike","Dunker","VfB Osnabrück","","","","","","","Verein für Bahnengolf Osnabrück von 1984 e. V."]
[18014,"Sm 2","Klaus","Dunker","SSC Halver","","","","","","","SSC Halver e. V."]
[43951,"Sw 2","Heike","Dunker","SSC Halver","","","","","","","SSC Halver e. V."]
[61825,"Sm 2","Otto","Duzella","SGC Hagen","","","","","","","Sterngolf-Club Hagen e. V."]
[36496,"H","Nick-Manuel","Eberle","MGC Wanne-Eickel","","","","","","","Minigolfclub Rot-Weiß Wanne-Eickel e. V."]
[45272,"Sm 2","Alfred","Ebert","BGS Hardenberg","","","","","","","BGS Hardenberg-Pötter e. V."]
[26534,"Sm 1","Robert","Ebi","MGF Hilzingen","","","","","","","Minigolffreunde Hilzingen 80 e. V."]
[26302,"Sw 1","Sabine","Ebi","MGF Hilzingen","","","","","","","Minigolffreunde Hilzingen 80 e. V."]
[46087,"Sm 1","Hans-Joachim","Eckerle","BGC Paderborn","","","","","","","1. Bahnengolfclub Paderborn e. V."]
[62030,"Sm 2","Horst","Eckloff","MGC Olympia Kiel","","","","","","","Miniaturgolfclub Olympia Kiel e. V."]
[66495,"Sm 2","Helmut","Eckstein","MGC Wolnzach","","","","","","","Miniaturgolf-Club Wolnzach e. V."]
[66496,"Sw 2","Sonja","Eckstein","MGC Wolnzach","","","","","","","Miniaturgolf-Club Wolnzach e. V."]
[27480,"Sm 1","Jürgen","Edelmann","BGC Heilbronn","","","","","","","Bahnengolf Club Heilbronn e. V."]
[38404,"Sw 1","Gina","Edsen","MGC Harrislee","","","","","","","Sportverein Minigolfclub Harrislee-Wassersleben e. V."]
[67313,"Sm 2","Thomas","Effenberger","MGC Bad Homburg","","","","","","","Minigolf-Club Bad Homburg e. V."]
[67312,"Sw 2","Cornelia","Effenberger","MGC Bad Homburg","","","","","","","Minigolf-Club Bad Homburg e. V."]
[46406,"Sm 1","Hans Jürgen","Egger","BGC Neutraubling","","","","","","","Bahnengolf-Club Neutraubling e. V."]
[4181,"Sm 2","Erich","Egger","MC Ilvesheim","","","","","","","Miniaturgolf-Club Ilvesheim e. V."]
[18298,"Sw 2","Irene","Egger","MC Ilvesheim","","","","","","","Miniaturgolf-Club Ilvesheim e. V."]
[48601,"Sm 2","Gerd","Ehlebracht","BGC Paderborn","","","","","","","1. Bahnengolfclub Paderborn e. V."]
[34426,"H","Sascha","Ehlers","MGC Peine","Ja","","","","","","1. Miniaturgolf-Club Peine von 1965 e. V."]
[33996,"Sm 2","Ulrich","Ehlert","HMC Büttgen","","","","","","","Hobbysport Miniaturgolfclub Büttgen e. V."]
[34006,"H","Christoph","Ehm","BGC Celle","Ja","","","","","","1. Bahnen-Golf-Club Celle von 1964 e. V."]
[46898,"Sw 1","Marion","Ehm","BGC Celle","Ja","","","","","","1. Bahnen-Golf-Club Celle von 1964 e. V."]
[34315,"Sm 1","Josef","Ehrenberg","MGC Bad Bocklet","","","","","","","Miniatur-Golf-Club \"Stahlquelle\", Bad Bocklet 1989 e. V."]
[67810,"Sm 2","Wolfgang","Ehrentraut","BGSC Gladbeck","","","","","","","Bahnengolfsportclub \"Gut Schlag\" Gladbeck e. V."]
[3634,"Sw 2","Gerda","Ehresmann","MGC Ludwigshafen","","","","","","","1. Miniatur-Golf-Club Ludwigshafen 1964 e. V."]
[30000,"Sm 2","Volkmar","Ehrhardt","BGC Celle","Ja","","","","","","1. Bahnen-Golf-Club Celle von 1964 e. V."]
[67144,"Jw","Gina","Ehrich","SV Lurup","","","","","","","Sportverein Lurup-Hamburg von 1923 e. V. Abteilung Bahnengolf"]
[29692,"H","Steffen","Ehrlich","BGC Neutraubling","","","","","","","Bahnengolf-Club Neutraubling e. V."]
[44758,"Sm 1","Marcus","Ehrlich","KGC Frankfurt","","","","","","","Kleingolfclub Waldstadion e. V. Frankfurt am Main\t"]
[66759,"Sm 1","Maximilian","Ehrnstraßer","MGC Ingolstadt","","","","","",""," Miniaturgolf-Club Ingolstadt e. V."]
[21680,"Sm 2","Karl-Heinz","Eichert","MGC Ladenburg","","","","","","","1. Miniaturgolf-Club Ladenburg e. V."]
[29197,"Sm 2","Joachim","Eichhorn","MGC Mainz","","","","","","","Erster Mainzer Minigolf-Club e. V. 1964"]
[67541,"Sw 1","Martina","Eichner","MGC Murnau","","","","","","","Minigolfclub Murnau am Staffelsee e. V."]
[36574,"H","Oliver","Eid","MSV Bad Kreuznach","","","","","","","MSV Bad Kreuznach e. V."]
[36575,"H","Steffen","Eid","MSV Bad Kreuznach","","","","","","","MSV Bad Kreuznach e. V."]
[33707,"H","Marco","Eigenbrod","SG Arheilgen","","","","","","","Sportgemeinschaft Arheilgen 1876/1945 e. V. Abteilung Bahnengolf"]
[49368,"Sm 2","Norbert","Eilert","VfM Bottrop","","","","","","","Verein für Minigolf Bottrop e. V."]
[49367,"Sw 2","Sigrid","Eilert","VfM Bottrop","","","","","","","Verein für Minigolf Bottrop e. V."]
[67308,"Sm 2","Jost-Ulrich","Eimer","MGC Nümbrecht","","","","","","","Minigolf-Club Nümbrecht e. V. "]
[36867,"Sw 1","Sabine","Eisele","MGF Kempten","","","","","","","Minigolf-Freunde Steinbruch Kempten e. V."]
[48283,"Sm 2","Dominikus","Eisele","MGF Kempten","","","","","","","Minigolf-Freunde Steinbruch Kempten e. V."]
[64032,"H","Markus","Eisen","MGC Diessen","","","","","","","Minigolf-Club Diessen e. V."]
[67376,"Sm 2","Hans","Eisen","MGC Diessen","","","","","","","Minigolf-Club Diessen e. V."]
[40364,"Sm 1","Peter","Eisenberger","OMGC Imgolstadt","","","","","","","Oberbayerische Minigolf-Club Ingolstadt e. V."]
[34412,"Sm 2","Hans-Dieter","Eiserfey","BGC Weseling","","","","","","","1. Bahnen-Golf-Club Wesseling 1975 e. V. "]
[24693,"Sm 2","Bernd","Eisermann","MGC Witten","","","","","","","Minigolfclub \"AS\" Witten 1963 e. V."]
[35449,"Sm 2","Dirk","Eisleben",{"$f":"VLOOKUP(L642,Kurznamen,2,0)","v":"BGC Paffendorf"},{"$f":"IF(VLOOKUP(L642,Kurznamen,3,0)=\"Ja\",\"Ja\",\"\")","v":""},"","","","","","Bahnengolf Club Schloß Paffendorf e. V."]
[4338,"Sw 2","Elfriede","Ekholm","MC Schriesheim","","","","","","","Miniaturgolf Sportclub Schriesheim e. V."]
[49246,"Sm 1","Karim","El Gharbi","MSV Bad Kreuznach","","","","","","","MSV Bad Kreuznach e. V."]
[27492,"D","Karin","Elbe","MGC Remseck","","","","","","","Miniaturgolf-Club 1978 Remseck a.N. e. V."]
[47500,"Sm 1","Markus","Elbe","MGC Remseck","","","","","","","Miniaturgolf-Club 1978 Remseck a.N. e. V."]
[29690,"H","Jörg","Elbert","MGC Wanne-Eickel","","","","","","","Minigolfclub Rot-Weiß Wanne-Eickel e. V."]
[38449,"H","Nikolei","Elich","SV Lurup","","","","","","","Sportverein Lurup-Hamburg von 1923 e. V. Abteilung Bahnengolf"]
[67217,"Sm 2","Klaus-Martin","Ellerbrock","MGC Felderbachtal","","","","","","","Minigolf-Club-Felderbachtal 1964 e. V."]
[35197,"Sm 1","Harry","Ellhoff","SV Gebhardshagen","Ja","","","","","","SV Glück Auf 1901 Gebhardshagen e. V. Abteilung Minigolf"]
[48907,"Sm 2","Thomas","Elmer","MGU Neviges","","","","","","","Minigolfunion Neviges-Odenthal 1968 e. V."]
[45330,"Sm 1","Robert","Elst","MGC Bamberg","","","","","","","1. Minigolfclub Bamberg e. V."]
[67523,"Sm 1","Thomas","Emde","MGC Kassel","Ja","","","","","","1. Mini-Golfsport-Club Kassel-Vellmar 1964 e. V."]
[66974,"Sw 1","Michaela","Emich","MC Weinheim","","","","","","","1. Miniaturgolf-Club Weinheim e. V."]
[66975,"Sm 2","Peter","Emich","MC Weinheim","","","","","","","1. Miniaturgolf-Club Weinheim e. V."]
[38419,"H","Tim","Emmendörffer","MGC Wanne-Eickel","","","","","","","Minigolfclub Rot-Weiß Wanne-Eickel e. V."]
[67247,"D","Brigitte","Emmerich","MGV Ansbach","","","","","","","MGV Ansbach e. V."]
[67246,"Jw","Lea","Emmerich","MGV Ansbach","","","","","","","MGV Ansbach e. V."]
[67201,"Schw","Lilly","Emmerich","BGC Bildstock","","","","","","","Bahnen-Golf-Club Bildstock e. V."]
[67131,"D","Sina","Emmerich-Weßa","BGC Bildstock","","","","","","","Bahnen-Golf-Club Bildstock e. V."]
[5082,"Sw 2","Hannelore","Endres","FMGC Lichtenfels","","","","","","","1. Fränkischer Minigolfclub Lichtenfels 1961 e. V."]
[67402,"Jm","Jonas","Endter","BGC Leipzig","","","","","","","1. Bahnen Golf Club Leipzig e. V."]
[67578,"Sm 1","Thomas","Engel","TSV Flöha","","","","","","","Turn- und Sportverein Flöha 1848 e. V. Abteilung Minigolf"]
[31683,"Sm 2","Wolfgang","Engel","MGC Schwaikheim","","","","","","","Miniaturgolf – Club Schwaikheim e. V."]
[41719,"H","Jens","Engelbracht","SC Dortmund","","","","","","","Sport-Club Olympia Dortmund e. V. "]
[1359,"Sm 2","Uwe","Engelmann","MGC Peine","Ja",2924,"","X","","","1. Miniaturgolf-Club Peine von 1965 e. V."]
[41246,"Sm 1","Thomas","Engesser","MGF Hilzingen","","","","","","","Minigolffreunde Hilzingen 80 e. V."]
[33460,"Sm 2","Heiner","Entelmann","MGV Bremen","Ja","","","","","","Miniatur-Golf-Verein Bremen e. V."]
[67102,"Schm","Jason","Erdem","Tempelhofer MV","","","","","","","Tempelhofer Miniaturgolf Verein von 1965 e. V."]
[45061,"Sm 1","Sven","Eresch","MC Schriesheim","","","","","","","Miniaturgolf Sportclub Schriesheim e. V."]
[4408,"Sm 2","Wolfgang","Erfurth","TV Trappenkamp","","","","","","","Turnverein Trappenkamp e. V. Sparte Minigolf"]
[35788,"Sm 2","Wolfram","Erhard","BGC Rheinau-Freistett","","","","","","","BGC Rheinau-Freistett e. V."]
[28046,"Sw 2","Isolde","Erhard","BGC Rheinau-Freistett","","","","","","","BGC Rheinau-Freistett e. V."]
[30972,"H","Florian","Erhart","BGC Landshut","","","","","","","1. Bahnengolf-Club Landshut e. V."]
[65946,"Sw 1","Sabine","Erhart","BGC Bremen","Ja","","","","","","Bahnen-Golf-Club Bremen e. V."]
[65947,"Sm 2","Matthias","Erhart","BGC Bremen","Ja",27673,"X","","","","Bahnen-Golf-Club Bremen e. V."]
[67715,"Sm 2","Hans-Jürgen","Erkel","KC Homburg","","","","","","","1. Kleingolf Club Homburg-Saar 1967 e. V."]
[28515,"Sm 1","Harald","Erlbruch","BGS Hardenberg","","","","","","","BGS Hardenberg-Pötter e. V."]
[42994,"Sm 1","Walter","Erlbruch","BGS Hardenberg","","","","","","","BGS Hardenberg-Pötter e. V."]
[23579,"Sw 2","Monika","Erlbruch","BGSV Kerpen","","","","","","","Bahnen-Golf-Sport-Vereinigung Kerpen e. V."]
[65927,"Sm 1","Klaus","Ernst","BGC Weseling","","","","","","","1. Bahnen-Golf-Club Wesseling 1975 e. V. "]
[67163,"Sw 1","Petra","Ernst","BGC Weseling","","","","","","","1. Bahnen-Golf-Club Wesseling 1975 e. V. "]
[40033,"Sw 2","Elisabeth","Ernstberger","BGC Landshut","","","","","","","1. Bahnengolf-Club Landshut e. V."]
[64551,"H","Daniel","Ertl","MGC Murnau","","","","","","","Minigolfclub Murnau am Staffelsee e. V."]
[63843,"Sm 1","Reinhold","Ertl","BGC Landshut","","","","","","","1. Bahnengolf-Club Landshut e. V."]
[65623,"Sw 1","Johanna","Ertl","BGC Landshut","","","","","","","1. Bahnengolf-Club Landshut e. V."]
[28086,"H","Dirk","Eschmann","MGC Ludwigshafen","","","","","","","1. Miniatur-Golf-Club Ludwigshafen 1964 e. V."]
[49300,"Sm 2","Jürgen","Eschmann","MGC Mainz","","","","","","","Erster Mainzer Minigolf-Club e. V. 1964"]
[29883,"Sm 1","Gerd","Esser","KGC Mönchengladbach","","","","","","","1. Klein-Golf-Club Mönchengladbach e. V."]
[61555,"Sm 2","Gerhard","Essig","Münchener MC","","","","","","","1. Münchener Minigolf-Club 1962 e. V."]
[36551,"H","Christian","Essler","Duisburger MC","","","","","","","1. Duisburger Minigolf Club 1962 e. V."]
[65940,"H","Alessandro","Essler","Duisburger MC","","","","","","","1. Duisburger Minigolf Club 1962 e. V."]
[37718,"Sm 2","Ferdinand","Essler","Duisburger MC","","","","","","","1. Duisburger Minigolf Club 1962 e. V."]
[60515,"Sm 2","Peter","Etienne","MC Lüdenscheid","","","","","","","MC 62 Lüdenscheid e. V."]
[67271,"Sm 2","Klaus-Dieter","Ewert","BSG Fürstenwalde","","","","","","","BSG Pneumant Fürstenwalde e. V. Abteilung Minigolf"]
[27708,"Sw 2","Karin","Exel","Berliner MSC","","","","","","","1. Berliner Miniaturgolf-Sportclub e. V. 1960"]
[66174,"Sw 1","Petra","Exner","Elbhavelland","","","","","","","Elbhavelland e. V. Abteilung Minigolfsport"]
[42435,"Sm 2","Frank","Exner","BGV Bergisch Land","","","","","","","Bahnengolf-Verein Bergisch Land 1962/63 e. V."]
[40821,"Sw 2","Karin","Exner","BGV Bergisch Land","","","","","","","Bahnengolf-Verein Bergisch Land 1962/63 e. V."]
[30064,"Sm 1","Holger","Fabry","MGC Göttingen","Ja","","","","","","1. Miniatur-Golfsport-Club 1970 Göttingen e. V."]
[33157,"H","Nils","Fabrytzek","BGC Goslar","Ja","","","","","","Bahnen-Golf-Club Goslar e. V."]
[28892,"Sw 1","Kirsten","Fahrenkrog","NDE Miniaturgolf","","","","","","","Niendorfer Miniaturgolf-Club von 1963 e. V."]
[67070,"H","Florian","Fahsel","MGV Eibenstock","","","","","","","Miniaturgolfverein Eibenstock 1997 e. V.\t"]
[67733,"D","Franziska","Falck","Elbhavelland","","","","","","","Elbhavelland e. V. Abteilung Minigolfsport"]
[33459,"H","Felix","Falge","VfB Osnabrück","","","","","","","Verein für Bahnengolf Osnabrück von 1984 e. V."]
[66478,"H","Martin","Fallenbüchel",{"$f":"VLOOKUP(L706,Kurznamen,2,0)","v":"MC Schriesheim"},{"$f":"IF(VLOOKUP(L706,Kurznamen,3,0)=\"Ja\",\"Ja\",\"\")","v":""},"","","","","","Miniaturgolf Sportclub Schriesheim e. V."]
[35374,"Sw 2","Christel","Fander","KGC Mönchengladbach","","","","","","","1. Klein-Golf-Club Mönchengladbach e. V."]
[67800,"Schm","Felix","Farun","MGC Wanne-Eickel","","","","","","","Minigolfclub Rot-Weiß Wanne-Eickel e. V."]
[67781,"H","Daniel","Faschewski","SV Gebhardshagen","Ja","","","","","","SV Glück Auf 1901 Gebhardshagen e. V. Abteilung Minigolf"]
[67780,"Schm","Jamie","Faschewski","SV Gebhardshagen","Ja","","","","","","SV Glück Auf 1901 Gebhardshagen e. V. Abteilung Minigolf"]
[38528,"Sm 1","Markus","Faßbender","HMC Büttgen","","","","","","","Hobbysport Miniaturgolfclub Büttgen e. V."]
[40560,"Sm 1","Thomas","Fassl","MGC Sulzfeld","","","","","","","Miniatur Golf Club Sulzfeld e. V."]
[67181,"Sw 2","Christine","Faulhaber","MGC Diessen","","","","","","","Minigolf-Club Diessen e. V."]
[67664,"Schm","Sam","Faust","MSC Bensheim-Auerbach","","","","","","","Minigolf-Sport-Club Bensheim-Auerbach e. V."]
[50859,"Sm 1","Sascha","Faust","MGC Wanne-Eickel","","","","","","","Minigolfclub Rot-Weiß Wanne-Eickel e. V."]
[48058,"Sw 1","Monika","Faust","MSC Bensheim-Auerbach","","","","","","","Minigolf-Sport-Club Bensheim-Auerbach e. V."]
[40148,"Sw 2","Gabriele","Faust","MSC Bensheim-Auerbach","","","","","","","Minigolf-Sport-Club Bensheim-Auerbach e. V."]
[67504,"D","Katja","Fay","SV Dreieichenhain","","","","","","","Sportverein 1890 e. V. Dreieichenhain Abteilung Bahnengolf"]
[67831,"Sm 2","Peter ","Fay","BSV Bad Homburg","","","","","","","Bahnengolf-Sportverein Bad Homburg v.d.H. e. V."]
[37734,"Sw 1","Karin","Fechter","MGC Hechingen","","","","","","","1. Minigolfclub Hechingen e. V."]
[37733,"Sm 2","Dieter","Fechter","MGC Hechingen","","","","","","","1. Minigolfclub Hechingen e. V."]
[40328,"Sm 2","Wolfgang","Federici","MGF Hilzingen","","","","","","","Minigolffreunde Hilzingen 80 e. V."]
[33710,"H","Torsten","Fellenberg","TSV Salzgitter","Ja","","","","","","Turn- und Sportverein Salzgitter e. V. Abteilung Bahnengolf"]
[33711,"Sw 1","Kerstin","Fellenberg","MGC Peine","Ja",11819,"","X","","","1. Miniaturgolf-Club Peine von 1965 e. V."]
[34721,"Sw 2","Christa","Fellenberg","MGC Peine","Ja","","","","","","1. Miniaturgolf-Club Peine von 1965 e. V."]
[45697,"Sm 1","Thomas","Fellmann","BGV Bergisch Land","","","","","","","Bahnengolf-Verein Bergisch Land 1962/63 e. V."]
[38610,"Sw 1","Prisca","Ferstl","MGC Murnau","","","","","","","Minigolfclub Murnau am Staffelsee e. V."]
[27873,"Sw 1","Christine","Feucht","BGC Singen","","","","","","","1. Bahnengolf-Club Singen e. V."]
[67059,"Sm 2","Wolfgang","Fiedler","BSV Asslar","","","","","","","Bahnengolf-Sportverein Aßlar 1987 e. V."]
[40819,"Sw 2","Bärbel","Fiedler","MGF Magdeburg","","","","","","","Minigolffreunde Magdeburg e. V."]
[66695,"Sm 2","Andreas","Filgertshofer","MGC Diessen","","","","","","","Minigolf-Club Diessen e. V."]
[48999,"Sm 1","Manfred","Finette","MSC Bad Godesberg","","","","","","","Minigolf-Sport-Club Bad Godesberg e. V."]
[33123,"H","Moritz","Fingerle","MSK Olching","","","","","","","Olchinger Minigolf Sport Klub e. V."]
[67531,"Sm 1","Christoph","Fink","BGC Paffendorf","","","","","","","Bahnengolf Club Schloß Paffendorf e. V."]
[1472,"H","Nikolas","Finsterer-Robnik","BGC Illertissen","","","","","","","Bahnengolfclub Illertissen e. V."]
[50426,"Sm 2","Ralf","Fischbach","MGC Mainz","","","","","","","Erster Mainzer Minigolf-Club e. V. 1964"]
[38177,"D","Patricia","Fischbeck","MGF Magdeburg","","","","","","","Minigolffreunde Magdeburg e. V."]
[37509,"H","Christoph","Fischer","NDE Miniaturgolf","","","","","","","Niendorfer Miniaturgolf-Club von 1963 e. V."]
[87507,"H","Daniel","Fischer","TG Höchberg","","","","","","","Turngemeinde Höchberg von 1862 Bahnengolf e. V."]
[38334,"D","Alexandra","Fischer","MSC Bad Godesberg","","","","","","","Minigolf-Sport-Club Bad Godesberg e. V."]
[67684,"D","Ronja","Fischer","MGC Mainz","","","","","","","Erster Mainzer Minigolf-Club e. V. 1964"]
[64495,"Jm","Kai-Erik","Fischer","MGC Kassel","Ja","","","","","","1. Mini-Golfsport-Club Kassel-Vellmar 1964 e. V."]
[37008,"Sm 1","Robert","Fischer","BGSV Kerpen","","","","","","","Bahnen-Golf-Sport-Vereinigung Kerpen e. V."]
[43000,"Sm 1","Frank","Fischer","MSC Bad Godesberg","","","","","","","Minigolf-Sport-Club Bad Godesberg e. V."]
[43587,"Sm 1","Marcus","Fischer","MGC Kassel","Ja",18086,"","","","X","1. Mini-Golfsport-Club Kassel-Vellmar 1964 e. V."]
[30855,"Sw 1","Susanne","Fischer","MSC Bad Godesberg","","","","","","","Minigolf-Sport-Club Bad Godesberg e. V."]
[43588,"Sw 1","Astrid","Fischer","MGC Kassel","Ja",18087,"X","","","X","1. Mini-Golfsport-Club Kassel-Vellmar 1964 e. V."]
[48906,"Sw 1","Annette","Fischer","MGU Neviges","","","","","","","Minigolfunion Neviges-Odenthal 1968 e. V."]
[25512,"Sm 2","Gerd","Fischer","MGC Süßen","","","","","","","1. Miniaturgolfclub Süßen e. V."]
[37510,"Sm 2","Dirk","Fischer","VfM Berlin","","","","","","","Verein für Minigolf e. V. Berlin"]
[40638,"Sm 2","Manfred","Fischer","MGC Bad Feilnbach","","","","","","","Minigolfclub Bad Feilnbach e. V."]
[49979,"Sm 2","Walter","Fischer","VfB Osnabrück","","","","","","","Verein für Bahnengolf Osnabrück von 1984 e. V."]
[66628,"Sm 2","Dirk","Fischer","BGV Backumer Tal","","","","","","","BGV Backumer Tal Herten e. V."]
[67763,"Sm 2","Martin","Fischer","MGC Bergisch Gladbach","","","","","","","Minigolf-Club Bergisch Gladbach Gierath e. V."]
[6768,"Sw 2","Heidi","Fischer","SSV Ulm","","","","","","","Schwimm- und Sportverein Ulm 1846 e. V. Abteilung Bahnengolf"]
[67749,"Schw","Eyleen","Flammann","BGC Bildstock","","","","","","","Bahnen-Golf-Club Bildstock e. V."]
[66900,"Sm 1","Marco","Flick","Kölner MC","","","","","","","Kölner Miniatur Golf Club e. V."]
[67756,"Schw","Fiona","Flohr","BGC Oberhausen","","","","","","","Bahnengolf-Club Oberhausen e. V."]
[51799,"Sm 2","Peter","Flohrschütz","BGC Schweinfurt","","","","","","","Bahnengolfclub Schweinfurt e. V."]
[66876,"Sm 1","Detlef","Flotin","BGC Dormagen","","","","","","","Bahnengolf-Club Dormagen e. V."]
[43145,"Sm 2","Heinz","Forkefeld","MGC Bad Salzuflen","","","","","","","Minigolf-Club Bad Salzuflen e. V."]
[67809,"H","Jan","Formella","BGSC Gladbeck","","","","","","","Bahnengolfsportclub \"Gut Schlag\" Gladbeck e. V."]
[38474,"H","Robin","Forsberg","Bochumer MC","","","","","","","Bochumer Minigolf-Club 1960 e. V."]
[38366,"Sm 2","Rainer","Förster","KGC Bad Urach","","","","","","","Klein-Golf-Club Bad Urach e. V."]
[6770,"Sm 2","Jürgen","Förstner","Hamburger MC","","","","","","","Hamburger Minigolf Club von 1965 e. V."]
[44134,"Sm 2","Manfred","Foy","Bochumer MC","","","","","","","Bochumer Minigolf-Club 1960 e. V."]
[43512,"Sm 1","Volker","Frahm","MGC Bad Oldesloe","","","","","","","Miniaturgolfclub Bad Oldesloe von 1964 e. V."]
[66698,"Jm","Fynn","Frank","MGC Karlshagen","","","","","","","Minigolfclub Karlshagen e. V."]
[21828,"Sm 2","Andreas","Frank","BSV München","","","","","","","Bahnengolfsportverein 86 München e. V."]
[38490,"Sm 2","Rolf","Frank",{"$f":"VLOOKUP(L770,Kurznamen,2,0)","v":"BSV Bad Homburg"},{"$f":"IF(VLOOKUP(L770,Kurznamen,3,0)=\"Ja\",\"Ja\",\"\")","v":""},"","","","","","Bahnengolf-Sportverein Bad Homburg v.d.H. e. V."]
[67450,"Sm 2","Bernhard","Frank","VfL Lohbrügge","","","","","","","Verein für Leibesübungen Lohbrügge von 1892 e. V. Abteilung Bahnengolf"]
[28168,"Sw 2","Petra","Frank","BSV München","","","","","","","Bahnengolfsportverein 86 München e. V."]
[67449,"Sw 2","Ute","Frank","VfL Lohbrügge","","","","","","","Verein für Leibesübungen Lohbrügge von 1892 e. V. Abteilung Bahnengolf"]
[29402,"D","Vanessa","Franke","BGV Rodalben","","","","","","","1. Bahnengolfverein Rodalben 1977 e. V."]
[43328,"Sm 1","Jörg","Franke","MGC Dormagen-Brechten","","","","","","","Minigolfclub Dormagen - Brechten e. V."]
[66522,"Sm 2","Ulrich","Franke","MGC Brunsbüttel","","","","","","","Miniaturgolf-Club Brunsbüttel e. V."]
[38052,"H","Maximilian","Frech","KC Homburg","","","","","","","1. Kleingolf Club Homburg-Saar 1967 e. V."]
[65518,"Sm 1","Sven","Frech","BSV Inzlingen","","","","","","","Bahnengolf-Sportverein Inzlingen 1979 e. V."]
[67409,"Sm 2","Klaus Dieter","Freimann","MSF Brilon","","","","","","","Minigolfsportfreunde Brilon e. V."]
[37980,"D","Rebecca","Freßmann","MGC Kassel","Ja","","","","","","1. Mini-Golfsport-Club Kassel-Vellmar 1964 e. V."]
[67766,"Sw 2","Chris Vanessa","Freudenberg","BV Sennestadt","","","","","","","BV Sennestadt e. V."]
[66629,"Sm 2","Wilfried","Freund","SG Arheilgen","","","","","","","Sportgemeinschaft Arheilgen 1876/1945 e. V. Abteilung Bahnengolf"]
[9289,"Sm 2","Ernst","Frick","MSC Bensheim-Auerbach","","","","","","","Minigolf-Sport-Club Bensheim-Auerbach e. V."]
[33916,"H","René","Fricke","BGC Heilbronn","","","","","","","Bahnengolf Club Heilbronn e. V."]
[30004,"Sm 1","Jörg","Fricker","SSC Attendorn","","","","","","","Sterngolf-Sport-Club Attendorn e. V."]
[66911,"Sm 1","Thomas","Friedmann","SG Weiterstadt","","","","","","","Sportgemeinde 1886 e. V. Weiterstadt Abteilung Bahnengolf"]
[66912,"Sw 1","Heike","Friedmann","SG Weiterstadt","","","","","","","Sportgemeinde 1886 e. V. Weiterstadt Abteilung Bahnengolf"]
[67654,"H","Patrick","Friedrich","MGC Murnau","","","","","","","Minigolfclub Murnau am Staffelsee e. V."]
[30258,"Sm 1","Holger","Friedrich","SV Lurup","","","","","","","Sportverein Lurup-Hamburg von 1923 e. V. Abteilung Bahnengolf"]
[37247,"Sm 1","Klaus","Friedrich","Biskirchener BGV","","","","","","","Biskirchener Bahnen-Golf-Verein e. V."]
[23796,"Sm 2","Hans-Joachim","Friedrich","MGC Biebertal","","","","","","","Miniatur-Golf-Club Freizeitzentrum Biebertal e. V."]
[62733,"Sm 2","Rolf","Friedrichs","BGC Hannover","Ja","","","","","","1. Bahnen-Golf-Club Hannover e. V."]
[31842,"Sm 2","Gerald","Friesacher","NMC Kelheim","","","","","","","1. Niederbayerischer Minigolf-Club Kelheim e. V."]
[65964,"Sw 1","Barbara","Friese","BGC Uerdingen","","","","","","","Bahnengolf-Club Uerdingen e. V."]
[65962,"Sm 2","Reinhard","Friese","BGC Uerdingen","","","","","","","Bahnengolf-Club Uerdingen e. V."]
[67216,"H","Oliver","Frings","MGC Bad Bodendorf","","","","","","","Miniaturgolfclub Bad Bodendorf e. V."]
[66642,"Jm","Martin","Fritsch","MSC Bensheim-Auerbach","","","","","","","Minigolf-Sport-Club Bensheim-Auerbach e. V."]
[27550,"Sm 2","Hans-Peter","Fritsch","MSC Bensheim-Auerbach","","","","","","","Minigolf-Sport-Club Bensheim-Auerbach e. V."]
[38328,"H","Christian","Fritz","MGC Ostheim/Rhön","","","","","","","Miniaturgolfclub Ostheim/Rhön e. V. "]
[49258,"D","Manuela","Fritz","MC Möve Cuxhaven","Ja","","","","","","Miniaturgolf-Club \"Möve\" Cuxhaven-Sahlenburg e. V."]
[40034,"H","Thies","Fritzenkötter","BGSV Castrop","","","","","","","Bahnengolfsportverein Castrop e. V. 1961"]
[37088,"Sm 2","Dietmar","Fritzenkötter","BGSV Castrop","","","","","","","Bahnengolfsportverein Castrop e. V. 1961"]
[37089,"Sw 2","Margot","Fritzenkötter","BGSV Castrop","","","","","","","Bahnengolfsportverein Castrop e. V. 1961"]
[24461,"Sm 2","Joachim","Fröhner","MGC Wanne-Eickel","","","","","","","Minigolfclub Rot-Weiß Wanne-Eickel e. V."]
[67819,"Schm","Johannes","Frönd","MGC Paderborn","","","","","","","1. Minigolf-Club Paderborn 1980 e. V."]
[87511,"D","Mariya","Frontzek","MGC Wanne-Eickel","","","","","","","Minigolfclub Rot-Weiß Wanne-Eickel e. V."]
[48981,"Sm 1","Sascha","Frontzek","MGC Wanne-Eickel","","","","","","","Minigolfclub Rot-Weiß Wanne-Eickel e. V."]
[49798,"H","Christian","Fuchs","NMC Kelheim","","","","","","","1. Niederbayerischer Minigolf-Club Kelheim e. V."]
[38576,"H","Tobias","Fuchs","MSK Neheim-Hüsten","","","","","","","MINIGOLF-SPORT-KLUB Neheim-Hüsten e. V."]
[31272,"Sm 1","Thomas","Fuchs","MC Künsebeck","","","","","","","Miniaturgolf Club Tigers Künsebeck e. V."]
[46404,"Sm 1","Andreas","Fuchs","BGC Neutraubling","","","","","","","Bahnengolf-Club Neutraubling e. V."]
[42170,"Sw 1","Tanja","Fuchs","MC Künsebeck","","","","","","","Miniaturgolf Club Tigers Künsebeck e. V."]
[5081,"Sw 2","Angela","Fuchs","BGC Neutraubling","","","","","","","Bahnengolf-Club Neutraubling e. V."]
[30940,"H","Manuel","Fugazza","MC Ilvesheim","","","","","","","Miniaturgolf-Club Ilvesheim e. V."]
[27212,"H","Stefan","Funk","MGC Oberkochen","","","","","","","Miniatur-Golfclub Oberkochen 1972 e. V."]
[35791,"Sm 1","Andreas","Fütterer","RKV Rheinstetten","","","","","","","Rad- und Kraftfahrervereins \"Solidarität\" Mörsch e. V. Abteilung Minigolf Wölfe Rheinstetten 02"]
[35793,"Sm 2","Thomas","Fütterer","RKV Rheinstetten","","","","","","","Rad- und Kraftfahrervereins \"Solidarität\" Mörsch e. V. Abteilung Minigolf Wölfe Rheinstetten 02"]
[67456,"Sm 2","Klaus-Jürgen","Gäbelein","BSG Fürstenwalde","","","","","","","BSG Pneumant Fürstenwalde e. V. Abteilung Minigolf"]
[67630,"Sm 2","Karl","Galbicska","MGC Bad Homburg","","","","","","","Minigolf-Club Bad Homburg e. V."]
[67759,"Sw 2","Rosemarie","Galbicska","MGC Bad Homburg","","","","","","","Minigolf-Club Bad Homburg e. V."]
[27566,"Sm 1","Jens","Galleinus","MSC Herscheid","","","","","","","Minigolf-Sportclub Herscheid 1963 e. V."]
[40205,"Sw 1","Ellen","Galleinus","MSC Herscheid","","","","","","","Minigolf-Sportclub Herscheid 1963 e. V."]
[66073,"Sm 2","Jürgen","Galz","BSV Bad Homburg","","","","","","","Bahnengolf-Sportverein Bad Homburg v.d.H. e. V."]
[66554,"H","Dennis","Garbe","MSG Kempten","","","","","","","Minigolf-Sport-Gemeinschaft Kempten e. V."]
[66553,"Sm 2","Michael","Garbe","MSG Kempten","","","","","","","Minigolf-Sport-Gemeinschaft Kempten e. V."]
[45293,"Sm 2","Bruno","Garbers","SC Dortmund","","","","","","","Sport-Club Olympia Dortmund e. V. "]
[37874,"Sm 2","Joachim","Garden","MGC Wanne-Eickel","","","","","","","Minigolfclub Rot-Weiß Wanne-Eickel e. V."]
[38168,"H","Chris","Garte","MV Lankwitzer Dragons","","","","","","","MV Lankwitzer Dragons e. V."]
[34722,"Sm 2","Wolfgang","Gasch","MGV Eibenstock","","","","","","","Miniaturgolfverein Eibenstock 1997 e. V.\t"]
[38592,"Sm 1","Timo","Gase","MC Gelsenkirchen","","","","","","","1. Minigolf Club Gelsenkirchen e. V."]
[65897,"Sw 1","Birgit","Gase","MC Gelsenkirchen","","","","","","","1. Minigolf Club Gelsenkirchen e. V."]
[67738,"Sm 2","Thomas","Gatawetzki-Köppchen","BGV Bergisch Land","","","","","","","Bahnengolf-Verein Bergisch Land 1962/63 e. V."]
[34092,"Sm 1","Wolfgang","Gaute","BGC Celle","Ja","","","","","","1. Bahnen-Golf-Club Celle von 1964 e. V."]
[67665,"Schw","Julia","Gawlowski",{"$f":"VLOOKUP(L834,Kurznamen,2,0)","v":"MSC Bensheim-Auerbach"},{"$f":"IF(VLOOKUP(L834,Kurznamen,3,0)=\"Ja\",\"Ja\",\"\")","v":""},"","","","","","Minigolf-Sport-Club Bensheim-Auerbach e. V."]
[67791,"Sm 2","Jörg","Gburek","BGV Backumer Tal","","","","","","","BGV Backumer Tal Herten e. V."]
[42043,"Sm 2","Kurt","Gebauer","MGC München","","","","","","","1. Miniaturgolfclub München-Feldmoching e. V."]
[66707,"D","Sarah","Gefreyer","BGC Diepholz","Ja",28970,"X","","","","Bahnen-Golf-Club Diepholz e. V."]
[67012,"Sm 1","Steffen","Gefreyer","BGC Bremen","Ja",29405,"X","","","X","Bahnen-Golf-Club Bremen e. V."]
[65466,"D","Alina","Gehrke","TSV Salzgitter","Ja",26090,"X","","","","Turn- und Sportverein Salzgitter e. V. Abteilung Bahnengolf"]
[1963,"Sm 1","Jörg","Gehrke","TSV Salzgitter","Ja",3527,"","X","","X","Turn- und Sportverein Salzgitter e. V. Abteilung Bahnengolf"]
[65468,"Sw 1","Cornelia","Gehrke","TSV Salzgitter","Ja",26092,"","","","X","Turn- und Sportverein Salzgitter e. V. Abteilung Bahnengolf"]
[67305,"Jm","Gabriel","Geishüttner","MSC Bad Godesberg","","","","","","","Minigolf-Sport-Club Bad Godesberg e. V."]
[67306,"Sm 1","Gerhard","Geishüttner","MGC Nümbrecht","","","","","","","Minigolf-Club Nümbrecht e. V. "]
[42662,"Sm 1","Ralf","Geissler","MGC Metzingen","","","","","","","1. Miniaturgolf Club Metzingen e. V."]
[43605,"Sm 1","Alexander","Geist","BGS Hardenberg","","","","","","","BGS Hardenberg-Pötter e. V."]
[24314,"Sw 1","Michaela","Geist","MSC Bensheim-Auerbach","","","","","","","Minigolf-Sport-Club Bensheim-Auerbach e. V."]
[41874,"Sm 1","Rainer","Gellermann","SGC Hagen","","","","","","","Sterngolf-Club Hagen e. V."]
[46093,"Sm 1","Thomas","Gemkow","MSF Brilon","","","","","","","Minigolfsportfreunde Brilon e. V."]
[65931,"Sm 1","Michael","Genzer","BGC Dormagen","","","","","","","Bahnengolf-Club Dormagen e. V."]
[34839,"Sm 1","Holger","Georgi","Reinickendorfer MGC","","","","","","","Reinickendorfer Miniatur - Golfsport - Club e. V."]
[35794,"H","Martin","Gerbert","RKV Rheinstetten","","","","","","","Rad- und Kraftfahrervereins \"Solidarität\" Mörsch e. V. Abteilung Minigolf Wölfe Rheinstetten 02"]
[67498,"Sw 2","Irmgard","Gerdeißen","BGC Garmisch","","","","","","","1. Bahnengolfclub Garmisch-Partenkirchen e. V."]
[34891,"H","Felix","Gerhardt","MGC Murnau","","","","","","","Minigolfclub Murnau am Staffelsee e. V."]
[35437,"H","Markus","Gerlach","MC Künsebeck","","","","","","","Miniaturgolf Club Tigers Künsebeck e. V."]
[35436,"Sm 2","Stefan","Gerlach","MGC Bad Salzuflen","","","","","","","Minigolf-Club Bad Salzuflen e. V."]
[5821,"Sm 2","Karl-Heinz","Gerwert","MGF Waldshut","","","","","","","Minigolffreunde Waldshut 1974 e. V."]
[37060,"H","Yannis","Geschonke","MSV Bad Münder/Springe","Ja","","","","","","Minigolf Sport-Verein Bad Münder/Springe von 2005 e. V."]
[35329,"H","Kevin","Gesell","MGC Bad Feilnbach","","","","","","","Minigolfclub Bad Feilnbach e. V."]
[41951,"Sw 1","Claudia","Geßner","Essener CGC","","","","","","","1. Essener cobiGOLF - Club \"Blau-Gold\" e. V."]
[25206,"Sm 1","Thomas","Giebenhain","MSC Bensheim-Auerbach","","","","","","","Minigolf-Sport-Club Bensheim-Auerbach e. V."]
[50294,"Sm 2","Heinz-Theo","Giegel","BGV Backumer Tal","","","","","","","BGV Backumer Tal Herten e. V."]
[67744,"Sw 1","Sandra","Gill","SSC Halver","","","","","","","SSC Halver e. V."]
[30460,"H","Pascal","Gillen","KC Homburg","","","","","","","1. Kleingolf Club Homburg-Saar 1967 e. V."]
[33015,"H","Marco","Ginal","MC Schriesheim","","","","","","","Miniaturgolf Sportclub Schriesheim e. V."]
[66864,"Sm 2","Rudolf","Ginschel","BSC Ennepetal","","","","","","","Bahngolf-Sport-Club Ennepetal e. V."]
[33433,"H","Dimitri","Gkotses","MGF Hammer","","","","","","","Minigolffreunde Hammer e. V."]
[36872,"H","Timo","Glaser","MC Schriesheim","","","","","","","Miniaturgolf Sportclub Schriesheim e. V."]
[38284,"H","Nils","Glaser","MC Schriesheim","","","","","","","Miniaturgolf Sportclub Schriesheim e. V."]
[31211,"Sw 1","Ute","Glaser","CGC Grötzingen","","","","","","","COBI-GOLF-CLUB Blau-Gelb Grötzingen 1968 e. V."]
[22832,"Sm 2","Helmut","Glaser","MGC Sulzfeld","","","","","","","Miniatur Golf Club Sulzfeld e. V."]
[55133,"Sm 2","Michael","Glaser","MGC Bad Soden","","","","","","","Miniaturgolfclub Bad Soden-Salmünster e. V."]
[66799,"H","Felix","Glück","MGC Mainz","","","","","","","Erster Mainzer Minigolf-Club e. V. 1964"]
[33705,"H","Jan","Göbel","MGC Wertheim","","","","","","","Minigolfdub Wertheim ´91 e. V."]
[67677,"Sm 1","Heiko","Göbel","MGC Bergisch Gladbach","","","","","","","Minigolf-Club Bergisch Gladbach Gierath e. V."]
[67146,"Sm 2","Günter","Göbel","MGC Felderbachtal","","","","","","","Minigolf-Club-Felderbachtal 1964 e. V."]
[67145,"Sw 2","Marina","Göbel","MGC Felderbachtal","","","","","","","Minigolf-Club-Felderbachtal 1964 e. V."]
[41340,"Sm 2","Michael","Gohl","VfB Osnabrück","","","","","","","Verein für Bahnengolf Osnabrück von 1984 e. V."]
[67218,"H","Thorsten","Goldau","BGV Backumer Tal","","","","","","","BGV Backumer Tal Herten e. V."]
[67233,"Sm 2","Holger","Goldenbow","MSV Bad Münder/Springe","Ja","","","","","","Minigolf Sport-Verein Bad Münder/Springe von 2005 e. V."]
[34013,"Sm 1","Heiko","Golder","Reinickendorfer MGC","","","","","","","Reinickendorfer Miniatur - Golfsport - Club e. V."]
[67503,"Sm 1","Michael","Goldhahn","MGC Lohfelden","Ja","","","","","","1. Miniatur-Golfsport-Club Lohfelden e. V."]
[36159,"Sm 2","Helmut","Goldschmidt","MSV Bad Kreuznach","","","","","","","MSV Bad Kreuznach e. V."]
[66631,"Sm 2","Heribert","Golka","BGC Hannover","Ja","","","","","","1. Bahnen-Golf-Club Hannover e. V."]
[66872,"Sm 1","Gerhard","Goller","FMGC Lichtenfels","","","","","","","1. Fränkischer Minigolfclub Lichtenfels 1961 e. V."]
[66763,"Jm","Michael","Goresch","NMC Kelheim","","","","","","","1. Niederbayerischer Minigolf-Club Kelheim e. V."]
[17705,"Sm 2","Erwin","Görgen","MGC Traben-Trarbach","","","","","","","Minigolfclub Traben-Trarbach e. V."]
[31965,"H","Dennis","Gorges","KC Homburg","","","","","","","1. Kleingolf Club Homburg-Saar 1967 e. V."]
[67035,"D","Petra","Görtz","MGC Mainz","","","","","","","Erster Mainzer Minigolf-Club e. V. 1964"]
[50035,"H","Andreas","Görtz-Fräßle","MGC Mainz","","","","","","","Erster Mainzer Minigolf-Club e. V. 1964"]
[65830,"D","Yvonne","Gose","VfM Berlin","","","","","","","Verein für Minigolf e. V. Berlin"]
[36076,"Sw 2","Ellen","Gose","VfM Berlin","","","","","","","Verein für Minigolf e. V. Berlin"]
[37377,"D","Sabrina","Gothmann","MGC Tuttlingen","","","","","","","Erster Minigolf - Club Tuttlingen e. V."]
[66227,"Sm 2","Wolfgang","Gotthard","BGC Garmisch","","","","","","","1. Bahnengolfclub Garmisch-Partenkirchen e. V."]
[66476,"D","Runa Sophia","Gottke","MGC Traben-Trarbach","","","","","","","Minigolfclub Traben-Trarbach e. V."]
[67425,"Jm","Leon","Göttlich","MC Ilvesheim","","","","","","","Miniaturgolf-Club Ilvesheim e. V."]
[38630,"H","Hendrik","Göttmann","SG Arheilgen","","","","","","","Sportgemeinschaft Arheilgen 1876/1945 e. V. Abteilung Bahnengolf"]
[38631,"Sm 2","Holger","Göttmann","SG Arheilgen","","","","","","","Sportgemeinschaft Arheilgen 1876/1945 e. V. Abteilung Bahnengolf"]
[67015,"Sm 2","Wolfgang","Gottschling",{"$f":"VLOOKUP(L898,Kurznamen,2,0)","v":"CGC Grötzingen"},{"$f":"IF(VLOOKUP(L898,Kurznamen,3,0)=\"Ja\",\"Ja\",\"\")","v":""},"","","","","","COBI-GOLF-CLUB Blau-Gelb Grötzingen 1968 e. V."]
[34709,"Sm 1","Holger","Götz","BGC Neutraubling","","","","","","","Bahnengolf-Club Neutraubling e. V."]
[67643,"H","Niklas","Götze","MGF Magdeburg","","","","","","","Minigolffreunde Magdeburg e. V."]
[67614,"Sw 2","Annette","Göz","MGC Bad Homburg","","","","","","","Minigolf-Club Bad Homburg e. V."]
[40135,"Sm 1","Christian","Graage","Preetzer TSV","","","","","","","Preetzer Turn- und Sportverein von 1861 e. V. Abteilung Minigolf"]
[37979,"Sm 2","Thomas","Gräber","MC Weinheim","","","","","","","1. Miniaturgolf-Club Weinheim e. V."]
[66812,"Sm 1","Wolfgang","Gräble","MGF Hilzingen","","","","","","","Minigolffreunde Hilzingen 80 e. V."]
[25675,"H","Markus","Grabrucker","OMGC Imgolstadt","","","","","","","Oberbayerische Minigolf-Club Ingolstadt e. V."]
[40381,"H","Stefan","Grabrucker","OMGC Imgolstadt","","","","","","","Oberbayerische Minigolf-Club Ingolstadt e. V."]
[30979,"D","Stephanie","Grabrucker","OMGC Imgolstadt","","","","","","","Oberbayerische Minigolf-Club Ingolstadt e. V."]
[63961,"Jw","Jasmin","Grabrucker","OMGC Imgolstadt","","","","","","","Oberbayerische Minigolf-Club Ingolstadt e. V."]
[67139,"Schw","Lena","Grabrucker","OMGC Imgolstadt","","","","","","","Oberbayerische Minigolf-Club Ingolstadt e. V."]
[67671,"Schw","Annika","Grabrucker","OMGC Imgolstadt","","","","","","","Oberbayerische Minigolf-Club Ingolstadt e. V."]
[5271,"Sm 2","Anton","Grabrucker","OMGC Imgolstadt","","","","","","","Oberbayerische Minigolf-Club Ingolstadt e. V."]
[28389,"Sm 2","Manfred","Grabrucker","OMGC Imgolstadt","","","","","","","Oberbayerische Minigolf-Club Ingolstadt e. V."]
[9033,"Sw 2","Elfriede","Grabrucker","OMGC Imgolstadt","","","","","","","Oberbayerische Minigolf-Club Ingolstadt e. V."]
[37359,"Sm 1","Lars","Graeber","BGV Bergisch Land","","","","","","","Bahnengolf-Verein Bergisch Land 1962/63 e. V."]
[33132,"Sm 2","Roger","Graf","MGC Traben-Trarbach","","","","","","","Minigolfclub Traben-Trarbach e. V."]
[66498,"Sm 1","Thomas","Gräf","MGC Bad Feilnbach","","","","","","","Minigolfclub Bad Feilnbach e. V."]
[34316,"H","Ingo","Graf von Mainberg","BGC Schweinfurt","","","","","","","Bahnengolfclub Schweinfurt e. V."]
[67794,"H","André","Grajek","CGC Hamm","","","","","","","Cobigolf-Verein Hamm 2019 e. V."]
[67471,"Sm 1","Olaf","Gralow","Essener CGC","","","","","","","1. Essener cobiGOLF - Club \"Blau-Gold\" e. V."]
[67472,"Sw 1","Regina","Gralow","Essener CGC","","","","","","","1. Essener cobiGOLF - Club \"Blau-Gold\" e. V."]
[34359,"Sm 2","Frank","Gramer","MGC Tuttlingen","","","","","","","Erster Minigolf - Club Tuttlingen e. V."]
[43923,"Sw 2","Petra","Gransee","BGSV Castrop","","","","","","","Bahnengolfsportverein Castrop e. V. 1961"]
[1344,"Sw 1","Susanne","Granz","MC Möve Cuxhaven","Ja",2909,"","","","X","Miniaturgolf-Club \"Möve\" Cuxhaven-Sahlenburg e. V."]
[45502,"Sm 1","Gerno","Grapengeter","MGC Dormagen-Brechten","","","","","","","Minigolfclub Dormagen - Brechten e. V."]
[66277,"D","Patricia","Gras","MGC Viernheim","","","","","","","MGC Millennium Viernheim e. V."]
[67320,"Sm 1","André","Gras","MGC Peine","Ja","","","","","","1. Miniaturgolf-Club Peine von 1965 e. V."]
[66658,"H","Lucas","Graumann","TSV Salzgitter","Ja","","","","","","Turn- und Sportverein Salzgitter e. V. Abteilung Bahnengolf"]
[66648,"H","Eicke","Greh","VfM Berlin","","","","","","","Verein für Minigolf e. V. Berlin"]
[30056,"Sm 1","Lars","Greiffendorf","MGC Mainz","","","","","","","Erster Mainzer Minigolf-Club e. V. 1964"]
[3800,"Sm 2","Hellmut","Greiffendorf","MGC Witten","","","","","","","Minigolfclub \"AS\" Witten 1963 e. V."]
[31762,"Sm 1","Thomas","Gress","MGC Bad Hersfeld","","","","","","","Miniatur-Golf-Club Bad Hersfeld e. V."]
[67095,"Schm","Simon","Griebat","MSK Olching","","","","","","","Olchinger Minigolf Sport Klub e. V."]
[46148,"Sm 1","Ottmar","Gries","SSV Ulm","","","","","","","Schwimm- und Sportverein Ulm 1846 e. V. Abteilung Bahnengolf"]
[67065,"Sw 1","Christine","Gries","SSV Ulm","","","","","","","Schwimm- und Sportverein Ulm 1846 e. V. Abteilung Bahnengolf"]
[25960,"Sm 2","Bernd","Grigo","VfM Bottrop","","","","","","","Verein für Minigolf Bottrop e. V."]
[37669,"H","Marcus","Grimm","BSV München","","","","","","","Bahnengolfsportverein 86 München e. V."]
[65794,"Sm 2","Wolf-Dieter","Grimm","SV Lurup","","","","","","","Sportverein Lurup-Hamburg von 1923 e. V. Abteilung Bahnengolf"]
[463,"Sm 1","Uwe","Grimme","NMC Kelheim","","","","","","","1. Niederbayerischer Minigolf-Club Kelheim e. V."]
[38540,"Sm 1","Robert","Grobe","MGC Wanne-Eickel","","","","","","","Minigolfclub Rot-Weiß Wanne-Eickel e. V."]
[66339,"Sm 2","Thomas","Grobe","BGC Hannover","Ja",28375,"X","","","X","1. Bahnen-Golf-Club Hannover e. V."]
[67029,"Sm 2","Bernhard","Gröbel","MGC Würzburg","","","","","","","Miniaturgolfsportverein Würzburg - Löwenbrücke e. V."]
[66416,"Sm 2","Ronald","Groenewoud","BGV Backumer Tal","","","","","","","BGV Backumer Tal Herten e. V."]
[36717,"Sm 2","Rainer","Grohse","MGC Brunsbüttel","","","","","","","Miniaturgolf-Club Brunsbüttel e. V."]
[65954,"H","Frederick","Grombein","Kölner MC","","","","","","","Kölner Miniatur Golf Club e. V."]
[66567,"Sm 2","Frank","Gromm","BGSC Gladbeck","","","","","","","Bahnengolfsportclub \"Gut Schlag\" Gladbeck e. V."]
[26423,"H","Markus","Groneberg","VfM Berlin","","","","","","","Verein für Minigolf e. V. Berlin"]
[65976,"Sm 2","Thomas","Gronski","MGC Wanne-Eickel","","","","","","","Minigolfclub Rot-Weiß Wanne-Eickel e. V."]
[65971,"Sw 2","Friederike","Gronski","MGC Wanne-Eickel","","","","","","","Minigolfclub Rot-Weiß Wanne-Eickel e. V."]
[67773,"H","Bruno","Grosjean","BGS Hardenberg","","","","","","","BGS Hardenberg-Pötter e. V."]
[22243,"Sw 2","Ina","Grosse","TV Trappenkamp","","","","","","","Turnverein Trappenkamp e. V. Sparte Minigolf"]
[38461,"H","Lennart","Großmann","MSC Wesel","","","","","","","1. Minigolf-Sportclub Wesel 66 66 e. V. "]
[30400,"Sm 2","Bertold","Großmann","MGC Sulzfeld","","","","","","","Miniatur Golf Club Sulzfeld e. V."]
[37516,"Sw 2","Rosemarie","Groteböhmer","MSC Bad Godesberg","","","","","","","Minigolf-Sport-Club Bad Godesberg e. V."]
[29588,"H","Stefan","Gruber","MGC Murnau","","","","","","","Minigolfclub Murnau am Staffelsee e. V."]
[31872,"H","Christoph","Grübl","NMC Kelheim","","","","","","","1. Niederbayerischer Minigolf-Club Kelheim e. V."]
[6550,"Sw 2","Sieglinde","Grübl","BGC Landshut","","","","","","","1. Bahnengolf-Club Landshut e. V."]
[3802,"Sm 2","Jürgen","Grügelsberg","MGC Witten","","","","","","","Minigolfclub \"AS\" Witten 1963 e. V."]
[3126,"Sw 2","Marianne","Grügelsberg","MGC Witten","","","","","","","Minigolfclub \"AS\" Witten 1963 e. V."]
[25695,"Sw 1","Iris","Grün","BGC Dormagen","","","","","","","Bahnengolf-Club Dormagen e. V."]
[67264,"Sm 2","Richard","Grünberg","TSV Kücknitz","","","","","","","Turn - und Sportverein Kücknitz von 1911 e. V. Abteilung Bahnengolf"]
[67567,"Schw","Isabella","Gründer","BGSC Gladbeck","","","","","","","Bahnengolfsportclub \"Gut Schlag\" Gladbeck e. V."]
[35168,"Sm 1","Dirk","Gründer",{"$f":"VLOOKUP(L962,Kurznamen,2,0)","v":"BGSC Gladbeck"},{"$f":"IF(VLOOKUP(L962,Kurznamen,3,0)=\"Ja\",\"Ja\",\"\")","v":""},"","","","","","Bahnengolfsportclub \"Gut Schlag\" Gladbeck e. V."]
[67454,"Sm 2","Eric","Grundmann","BGC Paffendorf","","","","","","","Bahnengolf Club Schloß Paffendorf e. V."]
[66883,"H","Thomas","Grundmüller","MGC Ingolstadt","","","","","",""," Miniaturgolf-Club Ingolstadt e. V."]
[66884,"H","Benedikt","Grundmüller","MGC Ingolstadt","","","","","",""," Miniaturgolf-Club Ingolstadt e. V."]
[44875,"Sm 1","Franz","Grundmüller","MGC Ingolstadt","","","","","",""," Miniaturgolf-Club Ingolstadt e. V."]
[44874,"Sw 1","Sonja","Grundmüller","MGC Ingolstadt","","","","","",""," Miniaturgolf-Club Ingolstadt e. V."]
[4233,"Sm 2","Adolf","Grüne","MGC Kassel","Ja","","","","","","1. Mini-Golfsport-Club Kassel-Vellmar 1964 e. V."]
[50093,"Sm 1","Frank","Grunert","TSV Salzgitter","Ja","","","","","","Turn- und Sportverein Salzgitter e. V. Abteilung Bahnengolf"]
[46269,"Sm 2","Uwe","Grüning","MC Rheinhausen","",19699,"","X","","","1. Minigolf-Club Rheinhausen e. V."]
[44280,"Sw 2","Eveline","Grüning","MC Rheinhausen","","","","","","","1. Minigolf-Club Rheinhausen e. V."]
[65943,"D","Luisa-Marie","Grüninger","MGC Murnau","","","","","","","Minigolfclub Murnau am Staffelsee e. V."]
[45426,"H","Christoph","Grunt","MGC Ludwigshafen","","","","","","","1. Miniatur-Golf-Club Ludwigshafen 1964 e. V."]
[6487,"Sm 2","Manfred","Grunwald","SSC Halver","","","","","","","SSC Halver e. V."]
[35795,"Sw 1","Beatriz","Grüßinger","RKV Rheinstetten","","","","","","","Rad- und Kraftfahrervereins \"Solidarität\" Mörsch e. V. Abteilung Minigolf Wölfe Rheinstetten 02"]
[46450,"Sm 2","Ulrich","Grützner","MC Möve Cuxhaven","Ja","","","","","","Miniaturgolf-Club \"Möve\" Cuxhaven-Sahlenburg e. V."]
[31639,"Sm 1","Andreas","Grzeski","BGSV Kerpen","","","","","","","Bahnen-Golf-Sport-Vereinigung Kerpen e. V."]
[22467,"Sm 2","Joachim","Grzyb-Bonsack","MSK Neheim-Hüsten","","","","","","","MINIGOLF-SPORT-KLUB Neheim-Hüsten e. V."]
[38611,"H","Julian","Guddat","BGV Bergisch Land","","","","","","","Bahnengolf-Verein Bergisch Land 1962/63 e. V."]
[35156,"H","Matthias","Guhe","KGC Mönchengladbach","","","","","","","1. Klein-Golf-Club Mönchengladbach e. V."]
[33357,"Sm 2","Jürgen","Gundermann","Rot-Weiß Syburg","","","","","","","Rot-Weiß Syburg 1960 e. V."]
[50029,"D","Nicole","Gundert","MGC Mainz","","","","","","","Erster Mainzer Minigolf-Club e. V. 1964"]
[67400,"Sm 2","Thomas","Guney","VfB Osnabrück","","","","","","","Verein für Bahnengolf Osnabrück von 1984 e. V."]
[48275,"Sm 1","Rudolf","Guni","MGC Murnau","","","","","","","Minigolfclub Murnau am Staffelsee e. V."]
[66718,"H","Kevin","Günther","Hamburger MC","","","","","","","Hamburger Minigolf Club von 1965 e. V."]
[6740,"Sm 2","Klaus","Gust","MGC Felderbachtal","","","","","","","Minigolf-Club-Felderbachtal 1964 e. V."]
[67591,"Jw","Anna-Lena","Gut","MGF Waldshut","","","","","","","Minigolffreunde Waldshut 1974 e. V."]
[31177,"Sm 1","Oliver","Gut","MGF Waldshut","","","","","","","Minigolffreunde Waldshut 1974 e. V."]
[67732,"Sm 2","Josef","Gut","MGC Bad Waldsee","","","","","","","Minigolf-Club Bad Waldsee 1990 e. V."]
[32535,"H","Benjamin","Güth","NDE Miniaturgolf","","","","","","","Niendorfer Miniaturgolf-Club von 1963 e. V."]
[43241,"Sm 1","Udo","Guttroff","MGC Metzingen","","","","","","","1. Miniaturgolf Club Metzingen e. V."]
[67734,"H","Marc","Haake","Elbhavelland","","","","","","","Elbhavelland e. V. Abteilung Minigolfsport"]
[38354,"Sw 1","Alexandra","Haas","BSV Ohlsbach","","","","","","","Bahnengolfsportverein 82 Ohlsbach e. V."]
[40878,"Sm 2","Wolfgang","Haas","BGC Bad Füssing","","","","","","","1. Bahnengolfclub Bad Füssing e. V."]
[67101,"Jm","Ben","Haase","SV Lurup","","","","","","","Sportverein Lurup-Hamburg von 1923 e. V. Abteilung Bahnengolf"]
[41960,"Sm 2","Guido","Haase","MGC Kassel","Ja","","","","","","1. Mini-Golfsport-Club Kassel-Vellmar 1964 e. V."]
[67344,"Sw 2","Erika","Haase","MGC Kassel","Ja","","","","","","1. Mini-Golfsport-Club Kassel-Vellmar 1964 e. V."]
[66539,"D","Felicitas","Haberl","MGC Ingolstadt","","","","","",""," Miniaturgolf-Club Ingolstadt e. V."]
[66838,"D","Lena","Haberl","MGC Ingolstadt","","","","","",""," Miniaturgolf-Club Ingolstadt e. V."]
[29277,"Sm 1","Volker","Haberl","MGC Ingolstadt","","","","","",""," Miniaturgolf-Club Ingolstadt e. V."]
[67452,"H","Markus","Haberland","BGC Paffendorf","","","","","","","Bahnengolf Club Schloß Paffendorf e. V."]
[27189,"Sm 2","Klaus","Hablitzel","MGC Tuttlingen","","","","","","","Erster Minigolf - Club Tuttlingen e. V."]
[67604,"Schw","Ronja","Hablowetz","MGV Ansbach","","","","","","","MGV Ansbach e. V."]
[67605,"Sm 1","Karlheinz","Hablowetz","MGV Ansbach","","","","","","","MGV Ansbach e. V."]
[27909,"Sm 2","Klaus","Habrich","MGC Süßen","","","","","","","1. Miniaturgolfclub Süßen e. V."]
[34559,"H","Danny","Hackel","MGC Homburger Land","","","","","","","MGC Homburger Land e. V."]
[37074,"Sm 2","Günter","Hackenberg","MGC Kassel","Ja",15082,"","X","","","1. Mini-Golfsport-Club Kassel-Vellmar 1964 e. V."]
[37079,"Sm 2","Willi","Hackenberg","BGC Wolfsburg","Ja",15087,"","X","","X","1. Bahnen - Golf - Club Wolfsburg e. V."]
[67832,"Sm 2","Rudolf","Häffner","BSV Bad Homburg","","","","","","","Bahnengolf-Sportverein Bad Homburg v.d.H. e. V."]
[36278,"Sm 2","Wolfgang","Hageböck","SSC Halver","","","","","","","SSC Halver e. V."]
[67501,"H","Andreas","Hagel","RKV Rheinstetten","","","","","","","Rad- und Kraftfahrervereins \"Solidarität\" Mörsch e. V. Abteilung Minigolf Wölfe Rheinstetten 02"]
[34296,"Sm 1","Robert","Hägele","MGC Bad Feilnbach","","","","","","","Minigolfclub Bad Feilnbach e. V."]
[66990,"H","David","Hagemeyer","BSV Bad Homburg","","","","","","","Bahnengolf-Sportverein Bad Homburg v.d.H. e. V."]
[17834,"Sm 2","Leo","Hagenlüke","BV Sennestadt","","","","","","","BV Sennestadt e. V."]
[35720,"H","Christopher","Hahn","BGV Backumer Tal","","","","","","","BGV Backumer Tal Herten e. V."]
[46374,"H","Timon","Hahn","VfB Osnabrück","","","","","","","Verein für Bahnengolf Osnabrück von 1984 e. V."]
[48646,"D","Corinna","Hahn","MGC Ludwigshafen","","","","","","","1. Miniatur-Golf-Club Ludwigshafen 1964 e. V."]
[44416,"Sm 1","Robert","Hahn","MGC Ludwigshafen","","","","","","","1. Miniatur-Golf-Club Ludwigshafen 1964 e. V."]
[65301,"Sm 2","Rolf","Haid","MGC Hechingen","","","","","","","1. Minigolfclub Hechingen e. V."]
[65300,"Sw 2","Kornelia","Haid","MGC Hechingen","","","","","","","1. Minigolfclub Hechingen e. V."]
[66432,"Sm 2","Thomas","Hainzl","MGC Bad Feilnbach","","","","","","","Minigolfclub Bad Feilnbach e. V."]
[42187,"Sm 2","Siegfried","Hake","BGC Goslar","Ja",17323,"","X","","","Bahnen-Golf-Club Goslar e. V."]
[66115,"Sm 1","Alexander","Halbauer","MSG Kempten","","","","","","","Minigolf-Sport-Gemeinschaft Kempten e. V."]
[42555,"Sm 1","Markus","Haller","NMC Kelheim","","","","","","","1. Niederbayerischer Minigolf-Club Kelheim e. V."]
[65847,"H","Markus","Hallhuber","BSV Inzlingen","","","","","","","Bahnengolf-Sportverein Inzlingen 1979 e. V."]
[47240,"Sm 1","Martin","Halscheidt",{"$f":"VLOOKUP(L1026,Kurznamen,2,0)","v":"MGC Wertheim"},{"$f":"IF(VLOOKUP(L1026,Kurznamen,3,0)=\"Ja\",\"Ja\",\"\")","v":""},"","","","","","Minigolfdub Wertheim ´91 e. V."]
[67724,"Sm 2","Wolfgang","Hamann","BSC Ennepetal","","","","","","","Bahngolf-Sport-Club Ennepetal e. V."]
[35765,"Sw 2","Marina","Hammann","MC Ilvesheim","","","","","","","Miniaturgolf-Club Ilvesheim e. V."]
[36423,"D","Melanie","Hammerschmidt","KC Homburg","","","","","","","1. Kleingolf Club Homburg-Saar 1967 e. V."]
[42281,"Sm 1","Michael","Hammon","BGC Bad Berneck","","","","","","","Bahnengolf-Club e. V. Bad Berneck"]
[43760,"Sw 1","Dagmar","Hammon","BGC Bad Berneck","","","","","","","Bahnengolf-Club e. V. Bad Berneck"]
[36282,"H","Dennis","Handtke","MSK Neheim-Hüsten","","","","","","","MINIGOLF-SPORT-KLUB Neheim-Hüsten e. V."]
[67148,"H","Jonas","Handtke","MSK Neheim-Hüsten","","","","","","","MINIGOLF-SPORT-KLUB Neheim-Hüsten e. V."]
[38511,"D","Sarah","Handtke","MSK Neheim-Hüsten","","","","","","","MINIGOLF-SPORT-KLUB Neheim-Hüsten e. V."]
[40161,"Sm 2","Michael","Handtke","MSK Neheim-Hüsten","","","","","","","MINIGOLF-SPORT-KLUB Neheim-Hüsten e. V."]
[63732,"Sm 2","Dieter","Hanisch","MGC Ingolstadt","","","","","",""," Miniaturgolf-Club Ingolstadt e. V."]
[49941,"H","Sven","Hänke","MC Elmshorn","","","","","","","Minigolf-Club Flora Elmshorn e. V."]
[26439,"Sm 2","Rainer","Hanker","BGSC Gladbeck","","","","","","","Bahnengolfsportclub \"Gut Schlag\" Gladbeck e. V."]
[45588,"Sm 2","Johann","Hann","SSV Ulm","","","","","","","Schwimm- und Sportverein Ulm 1846 e. V. Abteilung Bahnengolf"]
[64724,"H","Andreas","Hannemann-Schmidhuber","BGC Landshut","","","","","","","1. Bahnengolf-Club Landshut e. V."]
[64722,"Sw 1","Claudia","Hannemann-Schmidhuber","BGC Landshut","","","","","","","1. Bahnengolf-Club Landshut e. V."]
[43553,"Sm 1","Jörg","Hannmann","NDE Miniaturgolf","","","","","","","Niendorfer Miniaturgolf-Club von 1963 e. V."]
[45795,"Sm 2","Jürgen","Hansel","CGC Illertal","","","","","","","Cobigolfclub Illertal Kellmünz e. V."]
[32383,"H","Mike","Hansen","MSC Bad Godesberg","","","","","","","Minigolf-Sport-Club Bad Godesberg e. V."]
[38016,"H","Pascal","Hansen","BGS Hardenberg","","","","","","","BGS Hardenberg-Pötter e. V."]
[28083,"D","Nicole","Hansen","MGC Bad Bodendorf","","","","","","","Miniaturgolfclub Bad Bodendorf e. V."]
[67093,"Schm","Marc","Hansen","MGC Bad Bodendorf","","","","","","","Miniaturgolfclub Bad Bodendorf e. V."]
[11,"Sm 1","Svend","Hansen","MGC Bad Oldesloe","","","","","","","Miniaturgolfclub Bad Oldesloe von 1964 e. V."]
[52109,"Sw 2","Sabine","Hansen","BGC Kiel-West","","","","","","","Bahnen-Golf-Club Kiel-West e. V."]
[38421,"Sm 1","Thomas","Hansper","VfM Berlin","","","","","","","Verein für Minigolf e. V. Berlin"]
[66157,"Sw 1","Heike","Hansper","VfM Berlin","","","","","","","Verein für Minigolf e. V. Berlin"]
[66853,"H","Martin","Hänßgen","MGF Magdeburg","","","","","","","Minigolffreunde Magdeburg e. V."]
[22800,"H","Jochen","Hänßler","MGC Tuttlingen","","","","","","","Erster Minigolf - Club Tuttlingen e. V."]
[37141,"H","Andreas","Hardt","VfM Berlin","","","","","","","Verein für Minigolf e. V. Berlin"]
[45059,"D","Claudia","Hardt","VfM Berlin","","","","","","","Verein für Minigolf e. V. Berlin"]
[50257,"Sw 2","Ute","Häring","SSV Ulm","","","","","","","Schwimm- und Sportverein Ulm 1846 e. V. Abteilung Bahnengolf"]
[25381,"Sm 2","Armin","Härle","MGC Oberkochen","","","","","","","Miniatur-Golfclub Oberkochen 1972 e. V."]
[36571,"H","Mark","Harmening","MGC Mainz","","","","","","","Erster Mainzer Minigolf-Club e. V. 1964"]
[19114,"Sm 2","Herbert","Harms","MSC Bensheim-Auerbach","","","","","","","Minigolf-Sport-Club Bensheim-Auerbach e. V."]
[67457,"Sw 2","Else","Harnyss","BSG Fürstenwalde","","","","","","","BSG Pneumant Fürstenwalde e. V. Abteilung Minigolf"]
[33191,"H","Stefan","Härtel","VfB Osnabrück","","","","","","","Verein für Bahnengolf Osnabrück von 1984 e. V."]
[4021,"Sm 2","Gustav","Hartfuhs","BGC Illertissen","","","","","","","Bahnengolfclub Illertissen e. V."]
[67013,"Jm","Max","Hartkorn","CGC Grötzingen","","","","","","","COBI-GOLF-CLUB Blau-Gelb Grötzingen 1968 e. V."]
[67121,"Sw 1","Tamara","Hartkorn","CGC Grötzingen","","","","","","","COBI-GOLF-CLUB Blau-Gelb Grötzingen 1968 e. V."]
[67120,"Sm 1","Mario","Hartkorn-Götz","CGC Grötzingen","","","","","","","COBI-GOLF-CLUB Blau-Gelb Grötzingen 1968 e. V."]
[49269,"Sm 2","Matthias","Hartl","MSC Bad Godesberg","","","","","","","Minigolf-Sport-Club Bad Godesberg e. V."]
[3874,"Sm 2","Wolfgang","Härtl","PTSV Hof","","","","","","","Post- und Telekom-Sportverein Hof e. V. Abteilung Minigolf "]
[44936,"Sm 2","Ingo","Hartlein","BGC Bad Nenndorf","Ja",18849,"X","","","","Bahnen-Golf-Club Bad Nenndorf e. V."]
[49,"Sm 1","Rolf","Hartmaier","BIG Asperg","","","","","","","Bahnengolf-Interessen-Gemeinschaft Asperg e. V. 1982"]
[33896,"Sm 2","Jürgen","Hartmaier","BGC Heilbronn","","","","","","","Bahnengolf Club Heilbronn e. V."]
[30051,"H","Jörg","Hartmann","Tempelhofer MV","","","","","","","Tempelhofer Miniaturgolf Verein von 1965 e. V."]
[36667,"H","Maximilian","Hartmann","BGC Illertissen","","","","","","","Bahnengolfclub Illertissen e. V."]
[63738,"H","Christian","Hartmann","MSG Kempten","","","","","","","Minigolf-Sport-Gemeinschaft Kempten e. V."]
[67106,"H","Leo","Hartmann","TSV Kücknitz","","","","","","","Turn - und Sportverein Kücknitz von 1911 e. V. Abteilung Bahnengolf"]
[5033,"Sm 2","Peter","Hartmann","CGC Grötzingen","","","","","","","COBI-GOLF-CLUB Blau-Gelb Grötzingen 1968 e. V."]
[26119,"Sm 2","Rochus","Hartmann","BGC Bad Nenndorf","Ja",7758,"","X","","","Bahnen-Golf-Club Bad Nenndorf e. V."]
[67641,"H","Andreas","Hartung","MGC Lohfelden","Ja","","","","","","1. Miniatur-Golfsport-Club Lohfelden e. V."]
[67788,"Sm 2","Detlef","Hartz","BSV Bad Homburg","","","","","","","Bahnengolf-Sportverein Bad Homburg v.d.H. e. V."]
[41738,"Sm 2","Friedrich","Haschberger","BGC Landshut","","","","","","","1. Bahnengolf-Club Landshut e. V."]
[38534,"H","Felix","Hasenberg","SGC Hagen","","","","","","","Sterngolf-Club Hagen e. V."]
[29346,"Sm 1","Christoph","Hasenberg","SGC Hagen","","","","","","","Sterngolf-Club Hagen e. V."]
[43147,"Sw 1","Heike","Hasenberg","SGC Hagen","","","","","","","Sterngolf-Club Hagen e. V."]
[37054,"Sm 2","Dirk","Hasenclever","BGC Leipzig","","","","","","","1. Bahnen Golf Club Leipzig e. V."]
[35711,"Sm 2","Johann","Hasenfuss","SC Bad Münder","Ja","","","","","","Sportclub Bad Münder e. V. Abteilung Bahnengolf"]
[66796,"H","Christian","Haß","BGC Bildstock","","","","","","","Bahnen-Golf-Club Bildstock e. V."]
[43779,"Sm 1","Lars","Hasse","MGC Göttingen","Ja",18182,"","X","","","1. Miniatur-Golfsport-Club 1970 Göttingen e. V."]
[34250,"Sm 2","Rainer","Hasse","Preetzer TSV","","","","","","","Preetzer Turn- und Sportverein von 1861 e. V. Abteilung Minigolf"]
[34249,"Sw 2","Monika","Hasse","Preetzer TSV","","","","","","","Preetzer Turn- und Sportverein von 1861 e. V. Abteilung Minigolf"]
[41949,"Sw 2","Agni","Hau","Essener CGC","","","","","","","1. Essener cobiGOLF - Club \"Blau-Gold\" e. V."]
[10992,"Sm 2","Franz","Haubner",{"$f":"VLOOKUP(L1090,Kurznamen,2,0)","v":"NMC Kelheim"},{"$f":"IF(VLOOKUP(L1090,Kurznamen,3,0)=\"Ja\",\"Ja\",\"\")","v":""},"","","","","","1. Niederbayerischer Minigolf-Club Kelheim e. V."]
[1541,"Sm 2","Uwe","Haubold","MGV Bremen","Ja","","","","","","Miniatur-Golf-Verein Bremen e. V."]
[67673,"D","Patricia","Haubrock","MGC Kassel","Ja","","","","","","1. Mini-Golfsport-Club Kassel-Vellmar 1964 e. V."]
[67521,"Jw","Felicitas","Haubrock","MGC Kassel","Ja","","","","","","1. Mini-Golfsport-Club Kassel-Vellmar 1964 e. V."]
[67620,"Sw 1","Ute","Haubrock","MGC Kassel","Ja","","","","","","1. Mini-Golfsport-Club Kassel-Vellmar 1964 e. V."]
[67621,"Sm 2","Willi","Haubrock","MGC Kassel","Ja","","","","","","1. Mini-Golfsport-Club Kassel-Vellmar 1964 e. V."]
[35810,"H","Timm","Haucke","SC Bastion Lippstadt","","","","","","","SC Bastion Rot - Weiß Lippstadt 1964 e. V."]
[4204,"Sm 2","Karlheinz","Haucke","SC Bastion Lippstadt","","","","","","","SC Bastion Rot - Weiß Lippstadt 1964 e. V."]
[31350,"Sm 1","Jörg","Hauer","BGC Heilbronn","","","","","","","Bahnengolf Club Heilbronn e. V."]
[37399,"D","Maike","Haupt","MGC Dormagen-Brechten","","","","","","","Minigolfclub Dormagen - Brechten e. V."]
[66998,"Jm","Lukas","Haupt","MGF Magdeburg","","","","","","","Minigolffreunde Magdeburg e. V."]
[37692,"Sm 1","Michael","Haupter","MGC Metzingen","","","","","","","1. Miniaturgolf Club Metzingen e. V."]
[34570,"Sw 2","Karin","Hauschke","MC Rheinhausen","","","","","","","1. Minigolf-Club Rheinhausen e. V."]
[67383,"Sm 2","Alois","Hauser","BSV Ohlsbach","","","","","","","Bahnengolfsportverein 82 Ohlsbach e. V."]
[35083,"Sm 2","Hans","Häuserer","BGC Garmisch","","","","","","","1. Bahnengolfclub Garmisch-Partenkirchen e. V."]
[65456,"Sm 1","Gerd","Hausmann","MGC Ludwigshafen","","","","","","","1. Miniatur-Golf-Club Ludwigshafen 1964 e. V."]
[35145,"Sm 2","Erich","Hauth","MGC Traben-Trarbach","","","","","","","Minigolfclub Traben-Trarbach e. V."]
[67686,"H","Thomas","Hayer","MGC Mainz","","","","","","","Erster Mainzer Minigolf-Club e. V. 1964"]
[37511,"H","Christian","Hebbeln","Hamburger MC","","","","","","","Hamburger Minigolf Club von 1965 e. V."]
[37853,"D","Carina","Hebbeln","Hamburger MC","","","","","","","Hamburger Minigolf Club von 1965 e. V."]
[32382,"H","Stefan","Hecken","MC Künsebeck","","","","","","","Miniaturgolf Club Tigers Künsebeck e. V."]
[20081,"Sm 2","Michael","Hecken","MC Neuwied","","","","","","","Miniaturgolfclub Neuwied e. V."]
[66901,"Jm","Sebastian","Heckmann","MGC Ladenburg","","","","","","","1. Miniaturgolf-Club Ladenburg e. V."]
[67726,"Sw 2","Elvira","Heddergott","MGC Bergisch Gladbach","","","","","","","Minigolf-Club Bergisch Gladbach Gierath e. V."]
[36956,"H","Tobias","Heer","MGC Bad Homburg","","","","","","","Minigolf-Club Bad Homburg e. V."]
[36425,"Sm 2","Ludwig","Heer","MGC Bad Homburg","","","","","","","Minigolf-Club Bad Homburg e. V."]
[30816,"Sw 1","Laila","Heerich","MGC Kassel","Ja","","","","","","1. Mini-Golfsport-Club Kassel-Vellmar 1964 e. V."]
[21948,"Sm 2","Ralph","Heerich","MGC Kassel","Ja",6606,"","X","","X","1. Mini-Golfsport-Club Kassel-Vellmar 1964 e. V."]
[67587,"H","Dominik","Heering","SSC Halver","","","","","","","SSC Halver e. V."]
[67681,"Schm","Tom","Heering","BSV München","","","","","","","Bahnengolfsportverein 86 München e. V."]
[67728,"Sm 1","Florin","Heering","BSV München","","","","","","","Bahnengolfsportverein 86 München e. V."]
[51888,"Sm 2","Hans-Joachim","Heese","MGC Biebertal","","","","","","","Miniatur-Golf-Club Freizeitzentrum Biebertal e. V."]
[26259,"Sm 2","Karl-Heinz","Hefner","MGC Ostheim/Rhön","","","","","","","Miniaturgolfclub Ostheim/Rhön e. V. "]
[36131,"H","Marcel","Heger","CGC Grötzingen","","","","","","","COBI-GOLF-CLUB Blau-Gelb Grötzingen 1968 e. V."]
[65149,"Sm 1","Thomas","Heger","MGC Heringen","","","","","","","Miniatur-Golf-Club Heringen e. V."]
[46457,"Sm 1","Falk","Heidecke","MC Möve Cuxhaven","Ja","","","","","","Miniaturgolf-Club \"Möve\" Cuxhaven-Sahlenburg e. V."]
[67562,"Sm 2","Karl-Heinz","Heidemann","VfM Bottrop","","","","","","","Verein für Minigolf Bottrop e. V."]
[67561,"Sw 2","Margarete","Heidemann","VfM Bottrop","","","","","","","Verein für Minigolf Bottrop e. V."]
[67598,"Sm 2","Bernd","Heidrich","BGC Hannover","Ja","","","","","","1. Bahnen-Golf-Club Hannover e. V."]
[67599,"Sw 2","Gabriele","Heidrich","BGC Hannover","Ja","","","","","","1. Bahnen-Golf-Club Hannover e. V."]
[28904,"Sw 2","Ursula","Heiliger","BGC Wolfsburg","Ja","","","","","","1. Bahnen - Golf - Club Wolfsburg e. V."]
[18150,"Sm 2","Horst","Heilmann","BGC Bochum","","","","","","","Bahnengolf-Sportclub Bochum 1978 e. V."]
[23436,"H","Dirk","Hein","Tempelhofer MV","","","","","","","Tempelhofer Miniaturgolf Verein von 1965 e. V."]
[29808,"Sm 1","Karsten","Hein","BGV Bergisch Land","","","","","","","Bahnengolf-Verein Bergisch Land 1962/63 e. V."]
[24422,"Sw 2","Helga","Hein","NMC Kelheim","","","","","","","1. Niederbayerischer Minigolf-Club Kelheim e. V."]
[40930,"H","Sebastian","Heine","MGC Dormagen-Brechten","","","","","","","Minigolfclub Dormagen - Brechten e. V."]
[1723,"Sm 2","Peter","Heine","BGC Hannover","Ja","","","","","","1. Bahnen-Golf-Club Hannover e. V."]
[33352,"H","Andreas","Heinel","MSK Olching","","","","","","","Olchinger Minigolf Sport Klub e. V."]
[35309,"D","Marina","Heinel","FMGC Lichtenfels","","","","","","","1. Fränkischer Minigolfclub Lichtenfels 1961 e. V."]
[66117,"H","Justin","Heinisch","BGC Bad Nenndorf","Ja","","","","","","Bahnen-Golf-Club Bad Nenndorf e. V."]
[35094,"D","Stefanie","Heinisch","BGC Bad Nenndorf","Ja","","","","","","Bahnen-Golf-Club Bad Nenndorf e. V."]
[66118,"Jm","Vincent","Heinisch","BGC Bad Nenndorf","Ja","","","","","","Bahnen-Golf-Club Bad Nenndorf e. V."]
[41617,"Sm 1","Marco","Heinisch","BGC Bad Nenndorf","Ja",17039,"","X","","","Bahnen-Golf-Club Bad Nenndorf e. V."]
[31397,"Sm 2","Hans-Werner","Heinisch","BGC Bad Nenndorf","Ja",10437,"","X","","","Bahnen-Golf-Club Bad Nenndorf e. V."]
[67607,"Sm 2","Herbert","Heinlein","MGV Ansbach","","","","","","","MGV Ansbach e. V."]
[67606,"Sw 2","Inge","Heinlein","MGV Ansbach","","","","","","","MGV Ansbach e. V."]
[31244,"D","Sabrina","Heinrich","MSV Bad Kreuznach","","","","","","","MSV Bad Kreuznach e. V."]
[5129,"Sm 2","Werner","Heinrich","MSC Wesel","","","","","","","1. Minigolf-Sportclub Wesel 66 66 e. V. "]
[48909,"Sm 1","Tobias","Heintze","MC Rheinhausen","","","","","","","1. Minigolf-Club Rheinhausen e. V."]
[65896,"Sm 2","Klaus","Heinz","MC Gelsenkirchen","","","","","","","1. Minigolf Club Gelsenkirchen e. V."]
[30057,"D","Doris","Heinze","BSV Leipzig","","","","","","","BSV AOK Leipzig e. V."]
[37194,"H","Ingmar","Heipel","SG Arheilgen","","","","","","","Sportgemeinschaft Arheilgen 1876/1945 e. V. Abteilung Bahnengolf"]
[50371,"Sw 1","Stefanie","Heise","MGC Bad Salzuflen","","","","","","","Minigolf-Club Bad Salzuflen e. V."]
[44726,"H","Thomas","Heisel","BGC Diepholz","Ja","","","","","","Bahnen-Golf-Club Diepholz e. V."]
[44731,"Sw 2","Regina","Heisel",{"$f":"VLOOKUP(L1154,Kurznamen,2,0)","v":"BGC Diepholz"},{"$f":"IF(VLOOKUP(L1154,Kurznamen,3,0)=\"Ja\",\"Ja\",\"\")","v":"Ja"},"","","","","","Bahnen-Golf-Club Diepholz e. V."]
[36965,"Sm 2","Dieter","Heisterklaus","MSK Neheim-Hüsten","","","","","","","MINIGOLF-SPORT-KLUB Neheim-Hüsten e. V."]
[67053,"Sm 2","Johann","Hejosch","BV Sennestadt","","","","","","","BV Sennestadt e. V."]
[66236,"Sw 2","Barbara","Helfmann","MGC Bergisch Gladbach","","","","","","","Minigolf-Club Bergisch Gladbach Gierath e. V."]
[49900,"H","Sven","Helldörfer","NMC Kelheim","","","","","","","1. Niederbayerischer Minigolf-Club Kelheim e. V."]
[5340,"Sm 2","Hans-Peter","Heller","BGSV Kerpen","","","","","","","Bahnen-Golf-Sport-Vereinigung Kerpen e. V."]
[30650,"Sm 2","Oswald","Heller","BGC Bad Berneck","","","","","","","Bahnengolf-Club e. V. Bad Berneck"]
[46285,"Sw 2","Gabriele","Heller","BGSV Kerpen","","","","","","","Bahnen-Golf-Sport-Vereinigung Kerpen e. V."]
[67022,"D","Jacqueline","Hellmann","MGC Wanne-Eickel","","","","","","","Minigolfclub Rot-Weiß Wanne-Eickel e. V."]
[46744,"Sw 1","Elvira","Hellmich","VfM Bottrop","","","","","","","Verein für Minigolf Bottrop e. V."]
[27801,"Sm 2","Uwe","Hellmich","VfM Bottrop","","","","","","","Verein für Minigolf Bottrop e. V."]
[32968,"Sm 1","Martin","Hellwig","CGC Hamm","","","","","","","Cobigolf-Verein Hamm 2019 e. V."]
[44381,"Sm 1","Markus","Hellwig","MGC Dormagen-Brechten","","","","","","","Minigolfclub Dormagen - Brechten e. V."]
[596,"Sw 1","Anja","Helmes","BGC Weseling","","","","","","","1. Bahnen-Golf-Club Wesseling 1975 e. V. "]
[6117,"Sm 2","Willi","Helmschmidt","MGC Ingolstadt","","","","","",""," Miniaturgolf-Club Ingolstadt e. V."]
[67551,"H","René","Hemgesberg","BGS Hardenberg","","","","","","","BGS Hardenberg-Pötter e. V."]
[66740,"Sm 1","Andreas","Hemmelmann","MGC Wertheim","","","","","","","Minigolfdub Wertheim ´91 e. V."]
[29993,"H","Martin","Hemmerling","TSV Pfungstadt","","","","","","","TSV Pfungstadt e. V. Abteilung Bahnengolf"]
[67650,"H","Stefan","Hempel","BIG Ingelfingen","","","","","","","Bahnengolf Interessen-Gemeinschaft Ingelfingen 2020 e. V."]
[67692,"Jm","Tim","Hengsberg","MGC Bad Bodendorf","","","","","","","Miniaturgolfclub Bad Bodendorf e. V."]
[34042,"H","Ulli","Hengstberger","SSV Ulm","","","","","","","Schwimm- und Sportverein Ulm 1846 e. V. Abteilung Bahnengolf"]
[22909,"Sm 1","Ulrich","Hengstler","BGC Singen","","","","","","","1. Bahnengolf-Club Singen e. V."]
[41231,"Sw 1","Claudia","Hengstler","BGC Singen","","","","","","","1. Bahnengolf-Club Singen e. V."]
[34712,"H","Björn","Henke","MGC Biebertal","","","","","","","Miniatur-Golf-Club Freizeitzentrum Biebertal e. V."]
[34118,"Sm 2","Klaus-Dieter","Henkel","MSV Bad Münder/Springe","Ja",12222,"X","","","","Minigolf Sport-Verein Bad Münder/Springe von 2005 e. V."]
[2061,"Sm 2","Helmut","Henkel","MGC Peine","Ja","","","","","","1. Miniaturgolf-Club Peine von 1965 e. V."]
[67274,"Sm 2","Eberhard","Henkel","BSG Fürstenwalde","","","","","","","BSG Pneumant Fürstenwalde e. V. Abteilung Minigolf"]
[50094,"Sm 1","Holger","Hennies","BGC Hannover","Ja","","","","","","1. Bahnen-Golf-Club Hannover e. V."]
[66516,"D","Simone","Hennig-Becker","TSV Pfungstadt","","","","","","","TSV Pfungstadt e. V. Abteilung Bahnengolf"]
[67645,"Schw","Annika-Eske","Henning","Tempelhofer MV","","","","","","","Tempelhofer Miniaturgolf Verein von 1965 e. V."]
[36074,"Sw 2","Petra","Henschke","VfM Berlin","","","","","","","Verein für Minigolf e. V. Berlin"]
[29252,"H","Danny","Hense","SG Arheilgen","","","","","","","Sportgemeinschaft Arheilgen 1876/1945 e. V. Abteilung Bahnengolf"]
[62946,"Sm 2","Josef","Hense","MGC Metzingen","","","","","","","1. Miniaturgolf Club Metzingen e. V."]
[62945,"Sw 2","Ingrid","Hense","MGC Metzingen","","","","","","","1. Miniaturgolf Club Metzingen e. V."]
[37011,"H","Tobias","Hensel","BSC Ennepetal","","","","","","","Bahngolf-Sport-Club Ennepetal e. V."]
[40199,"H","Florian","Hensel","BSC Ennepetal","","","","","","","Bahngolf-Sport-Club Ennepetal e. V."]
[66136,"H","Julian","Hensel","BSC Ennepetal","","","","","","","Bahngolf-Sport-Club Ennepetal e. V."]
[66533,"Jw","Annika Sophia","Hensel","BSC Ennepetal","","","","","","","Bahngolf-Sport-Club Ennepetal e. V."]
[46247,"Sm 1","Peter","Hensel","BSC Ennepetal","","","","","","","Bahngolf-Sport-Club Ennepetal e. V."]
[48052,"Sw 1","Heike","Hensel","BSC Ennepetal","","","","","","","Bahngolf-Sport-Club Ennepetal e. V."]
[65852,"Sm 2","Rainer","Henseler","MGC Paderborn","","","","","","","1. Minigolf-Club Paderborn 1980 e. V."]
[40589,"Sm 1","Steffen","Hentschel","VfM Berlin","","","","","","","Verein für Minigolf e. V. Berlin"]
[26232,"Sm 2","Andreas","Henze","MGC Göttingen","Ja","","","","","","1. Miniatur-Golfsport-Club 1970 Göttingen e. V."]
[3564,"Sm 2","Karl","Herbich","MSK Olching","","","","","","","Olchinger Minigolf Sport Klub e. V."]
[34669,"Sm 1","Jan","Herbig","MC Ilvesheim","","","","","","","Miniaturgolf-Club Ilvesheim e. V."]
[18029,"Sm 2","Lothar","Herfurt","VfM Berlin","","","","","","","Verein für Minigolf e. V. Berlin"]
[38653,"Sm 2","Dirk","Hergesell","VfM Berlin","","","","","","","Verein für Minigolf e. V. Berlin"]
[67590,"Sm 2","Hans-Jürgen","Herhold","MC Rheinhausen","","","","","","","1. Minigolf-Club Rheinhausen e. V."]
[67702,"H","Eric","Herlitze","BGC Bochum","","","","","","","Bahnengolf-Sportclub Bochum 1978 e. V."]
[31267,"H","Alexander","Hermann","MGC Mainz","","","","","","","Erster Mainzer Minigolf-Club e. V. 1964"]
[31268,"H","Max","Hermann","MGC Mainz","","","","","","","Erster Mainzer Minigolf-Club e. V. 1964"]
[67319,"Schm","David","Hermann","MGC Mainz","","","","","","","Erster Mainzer Minigolf-Club e. V. 1964"]
[6621,"Sm 2","Gerhard","Hermann","MGC Monrepos","","","","","","","Minigolfclub Monrepos e. V."]
[29935,"Sm 1","Marc","Herrmann","MGC Göttingen","Ja","","","","","","1. Miniatur-Golfsport-Club 1970 Göttingen e. V."]
[28696,"Sm 2","Otmar","Herrmann","MGC Traben-Trarbach","","","","","","","Minigolfclub Traben-Trarbach e. V."]
[62403,"Sm 2","Achim","Hertzberg","Rot-Weiß Syburg","","","","","","","Rot-Weiß Syburg 1960 e. V."]
[6270,"Sw 2","Doris","Hertzberg","Rot-Weiß Syburg","","","","","","","Rot-Weiß Syburg 1960 e. V."]
[67127,"Sm 1","Frank","Herwig","MGC Göttingen","Ja","","","","","","1. Miniatur-Golfsport-Club 1970 Göttingen e. V."]
[66935,"Sw 1","Heidi","Herz","MSC Neu-Wulstorf","","","","","","","1. Minigolf-Sport-Club Hamburg-Neu-Wulmstorf e. V."]
[31952,"Sm 1","Sven","Herzberger","TG Höchberg","","","","","","","Turngemeinde Höchberg von 1862 Bahnengolf e. V."]
[38197,"H","Frederik","Herzic","MGC Metzingen","","","","","","","1. Miniaturgolf Club Metzingen e. V."]
[46823,"Sm 1","Ralf","Herzog","TSV Pfungstadt","","","","","","","TSV Pfungstadt e. V. Abteilung Bahnengolf"]
[50402,"Sm 1","Hagen","Herzog","MGF Magdeburg","","","","","","","Minigolffreunde Magdeburg e. V."]
[67704,"Schm","Luca","Hes","BGV Backumer Tal","","","","","","","BGV Backumer Tal Herten e. V."]
[34103,"Sw 2","Sigrid","Hesker",{"$f":"VLOOKUP(L1218,Kurznamen,2,0)","v":"MGC Bergisch Gladbach"},{"$f":"IF(VLOOKUP(L1218,Kurznamen,3,0)=\"Ja\",\"Ja\",\"\")","v":""},"","","","","","Minigolf-Club Bergisch Gladbach Gierath e. V."]
[33843,"H","Danny","Hess","MGC Mainz","","","","","","","Erster Mainzer Minigolf-Club e. V. 1964"]
[44929,"Sm 1","Rainer","Hess","SG Arheilgen","","","","","","","Sportgemeinschaft Arheilgen 1876/1945 e. V. Abteilung Bahnengolf"]
[67488,"Sm 1","Bernd","Hess","MGF Kempten","","","","","","","Minigolf-Freunde Steinbruch Kempten e. V."]
[17936,"Sm 2","Erich","Hess","SG Arheilgen","","","","","","","Sportgemeinschaft Arheilgen 1876/1945 e. V. Abteilung Bahnengolf"]
[3600,"Sw 2","Renate","Hess","SG Arheilgen","","","","","","","Sportgemeinschaft Arheilgen 1876/1945 e. V. Abteilung Bahnengolf"]
[3863,"Sm 2","Dietmar","Hesse","BGC Goslar","Ja",3886,"","X","","X","Bahnen-Golf-Club Goslar e. V."]
[29405,"Sw 2","Karin","Hesse","BGC Goslar","Ja",9181,"","","","X","Bahnen-Golf-Club Goslar e. V."]
[34749,"Sw 1","Sandra","Hess-Struchen","SG Arheilgen","","","","","","","Sportgemeinschaft Arheilgen 1876/1945 e. V. Abteilung Bahnengolf"]
[35237,"H","Robin","Hettrich","MGC Dormagen-Brechten","","","","","","","Minigolfclub Dormagen - Brechten e. V."]
[35236,"Sm 2","Willi","Hettrich","BGSV Castrop","","","","","","","Bahnengolfsportverein Castrop e. V. 1961"]
[38602,"H","Bernd","Heublein","FMGC Lichtenfels","","","","","","","1. Fränkischer Minigolfclub Lichtenfels 1961 e. V."]
[19478,"Sw 1","Andrea","Heublein","FMGC Lichtenfels","","","","","","","1. Fränkischer Minigolfclub Lichtenfels 1961 e. V."]
[30655,"Sw 1","Silvia","Heublein","MGC Göttingen","Ja",9974,"","X","","","1. Miniatur-Golfsport-Club 1970 Göttingen e. V."]
[37959,"H","Florian","Heuer","Preetzer TSV","","","","","","","Preetzer Turn- und Sportverein von 1861 e. V. Abteilung Minigolf"]
[67422,"D","Melanie","Heuger","PTSV Hof","","","","","","","Post- und Telekom-Sportverein Hof e. V. Abteilung Minigolf "]
[66345,"H","Andreas","Heuser","MGC Bad Bodendorf","","","","","","","Miniaturgolfclub Bad Bodendorf e. V."]
[33530,"H","Marcus","Hey","OMGC Imgolstadt","","","","","","","Oberbayerische Minigolf-Club Ingolstadt e. V."]
[5326,"Sm 2","Rudolf","Heydenreich","MGC Traben-Trarbach","","","","","","","Minigolfclub Traben-Trarbach e. V."]
[49901,"H","Christian","Heyder","BGC Bad Berneck","","","","","","","Bahnengolf-Club e. V. Bad Berneck"]
[6367,"Sw 2","Angelika","Heyder","MGC Murnau","","","","","","","Minigolfclub Murnau am Staffelsee e. V."]
[40457,"Sm 1","Torsten","Heydt","MGC Olympia Kiel","","","","","","","Miniaturgolfclub Olympia Kiel e. V."]
[44771,"Sm 1","Lars","Heydt","MGC Olympia Kiel","","","","","","","Miniaturgolfclub Olympia Kiel e. V."]
[37254,"Sm 1","Hans Bernd","Heyer","MGC Bergisch Gladbach","","","","","","","Minigolf-Club Bergisch Gladbach Gierath e. V."]
[20291,"Sm 2","Peter","Heynen","BGC Celle","Ja",6320,"","","","X","1. Bahnen-Golf-Club Celle von 1964 e. V."]
[46250,"Sm 2","Peter","Hickert","MSF Brilon","","","","","","","Minigolfsportfreunde Brilon e. V."]
[67054,"Sw 2","Ursula","Hiebsch","BV Sennestadt","","","","","","","BV Sennestadt e. V."]
[5839,"Sm 2","Georg","Hilbert","MGC Epe","","","","","","","1. Minigolfclub Epe 1978 e. V."]
[66659,"H","Justin","Hildebrandt","BGS Hardenberg","","","","","","","BGS Hardenberg-Pötter e. V."]
[38437,"Sm 1","Andreas","Hildebrandt","SV Gebhardshagen","Ja","","","","","","SV Glück Auf 1901 Gebhardshagen e. V. Abteilung Minigolf"]
[27536,"H","Christian","Hilgenberg","MGC Kassel","Ja","","","","","","1. Mini-Golfsport-Club Kassel-Vellmar 1964 e. V."]
[5289,"Sw 2","Ursula","Hillebrecht","MGC Göttingen","Ja","","","","","","1. Miniatur-Golfsport-Club 1970 Göttingen e. V."]
[50172,"Sm 2","Reinhold","Hilß","MC Weinheim","","","","","","","1. Miniaturgolf-Club Weinheim e. V."]
[45368,"Sm 1","Klaus","Hiltner","MSG Kempten","","","","","","","Minigolf-Sport-Gemeinschaft Kempten e. V."]
[67609,"Schm","Tom","Hinkelmann","SSC Attendorn","","","","","","","Sterngolf-Sport-Club Attendorn e. V."]
[26579,"Sm 2","Holger","Hinsel","MSF Brilon","","","","","","","Minigolfsportfreunde Brilon e. V."]
[66442,"Jm","Raphael","Hintermeier","BGC Neutraubling","","","","","","","Bahnengolf-Club Neutraubling e. V."]
[49154,"Sm 1","Paul","Hirle","MSC München","","","","","","","Minigolf-Sport-Club blau-weiß 2003 e. V. München"]
[87512,"Jm","Jonathan","Hirsch","Hamburger MC","","","","","","","Hamburger Minigolf Club von 1965 e. V."]
[87513,"Jm","Theodor","Hirsch","Hamburger MC","","","","","","","Hamburger Minigolf Club von 1965 e. V."]
[38170,"Sm 1","Peter","Hisserich","MGC Bad Homburg","","","","","","","Minigolf-Club Bad Homburg e. V."]
[37644,"D","Rebecca","Hoch","MGC Dormagen-Brechten","","","","","","","Minigolfclub Dormagen - Brechten e. V."]
[3127,"Sm 2","Bruno","Hoch","BGSV Kerpen","","","","","","","Bahnen-Golf-Sport-Vereinigung Kerpen e. V."]
[25846,"Sm 2","Raimund","Hoch","BGSV Kerpen","","","","","","","Bahnen-Golf-Sport-Vereinigung Kerpen e. V."]
[67336,"Jm","Markus","Höcherl","MGC Murnau","","","","","","","Minigolfclub Murnau am Staffelsee e. V."]
[49074,"Sm 1","Michael","Hoefig","HMC Büttgen","","","","","","","Hobbysport Miniaturgolfclub Büttgen e. V."]
[49067,"Sw 2","Hildegard","Hoefig","HMC Büttgen","","","","","","","Hobbysport Miniaturgolfclub Büttgen e. V."]
[27994,"Sm 2","Heinz","Höferlin","BSV Inzlingen","","","","","","","Bahnengolf-Sportverein Inzlingen 1979 e. V."]
[40282,"Sm 1","Jörg","Hoffmann","MGC Mainz","","","","","","","Erster Mainzer Minigolf-Club e. V. 1964"]
[42242,"Sm 1","Carsten","Hoffmann","MSC Herscheid","","","","","","","Minigolf-Sportclub Herscheid 1963 e. V."]
[5093,"Sm 2","Helmut","Hoffmann","MSC Bad Godesberg","","","","","","","Minigolf-Sport-Club Bad Godesberg e. V."]
[40278,"Sm 2","Joachim","Hoffmann","MGC Bergisch Gladbach","","","","","","","Minigolf-Club Bergisch Gladbach Gierath e. V."]
[60566,"Sm 2","Helmut-Karl","Hoffmann","MGC Bergisch Gladbach","","","","","","","Minigolf-Club Bergisch Gladbach Gierath e. V."]
[36636,"H","Thomas","Höfler","KC Homburg","","","","","","","1. Kleingolf Club Homburg-Saar 1967 e. V."]
[30938,"H","Michael","Hofmann","MC Ilvesheim","","","","","","","Miniaturgolf-Club Ilvesheim e. V."]
[35619,"H","Benjamin","Hofmann","MGC Wetzlar","","","","","","","Miniatur-Golf-Club Wetzlar e. V."]
[66000,"H","Yannick","Hofmann","ASV Pegnitz","","","","","","","Allgemeiner Sportverein Pegnitz e. V. Abteilung Minigolf"]
[66001,"H","Fabian","Hofmann","ASV Pegnitz","","","","","","","Allgemeiner Sportverein Pegnitz e. V. Abteilung Minigolf"]
[67736,"D","Evelyn","Hofmann","NDE Miniaturgolf","","","","","","","Niendorfer Miniaturgolf-Club von 1963 e. V."]
[67735,"Schm","Lennard","Hofmann","NDE Miniaturgolf","","","","","","","Niendorfer Miniaturgolf-Club von 1963 e. V."]
[66263,"Sm 1","Klaus","Hofmann","ASV Pegnitz","","","","","","","Allgemeiner Sportverein Pegnitz e. V. Abteilung Minigolf"]
[65213,"Sm 2","Jean-Daniel","Hofstetter","MGF Waldshut","","","","","","","Minigolffreunde Waldshut 1974 e. V."]
[34294,"D","Tamara","Hohenadler","MGC Bad Feilnbach","","","","","","","Minigolfclub Bad Feilnbach e. V."]
[65319,"Jw","Annalena","Hohenadler","MGC Bad Feilnbach","","","","","","","Minigolfclub Bad Feilnbach e. V."]
[40858,"Sm 1","Markus","Hohenadler",{"$f":"VLOOKUP(L1282,Kurznamen,2,0)","v":"MGC Bad Feilnbach"},{"$f":"IF(VLOOKUP(L1282,Kurznamen,3,0)=\"Ja\",\"Ja\",\"\")","v":""},"","","","","","Minigolfclub Bad Feilnbach e. V."]
[66093,"Sw 1","Christine","Hohmann","BGC Hannover","Ja","","","","","","1. Bahnen-Golf-Club Hannover e. V."]
[4513,"Sm 2","Edgard","Höhmann","MGC Kassel","Ja","","","","","","1. Mini-Golfsport-Club Kassel-Vellmar 1964 e. V."]
[6522,"Sm 2","Holger","Hohnke","MGC Olympia Kiel","","","","","","","Miniaturgolfclub Olympia Kiel e. V."]
[36460,"H","Hans-Joachim","Höhnke","Tempelhofer MV","","","","","","","Tempelhofer Miniaturgolf Verein von 1965 e. V."]
[66955,"Jw","Carlotta","Höing","VfB Osnabrück","","","","","","","Verein für Bahnengolf Osnabrück von 1984 e. V."]
[66694,"Sm 1","Georg","Hoiss","MGC Diessen","","","","","","","Minigolf-Club Diessen e. V."]
[66922,"Sw 1","Martina","Hoiss","MGC Diessen","","","","","","","Minigolf-Club Diessen e. V."]
[38118,"Sw 1","Claudia","Holderberg","BGC Bochum","","","","","","","Bahnengolf-Sportclub Bochum 1978 e. V."]
[38119,"Sm 2","Hans-Peter","Holderberg","BGC Bochum","","","","","","","Bahnengolf-Sportclub Bochum 1978 e. V."]
[67626,"Jm","Luca","Hölldobler","MGV Ansbach","","","","","","","MGV Ansbach e. V."]
[67165,"Sw 1","Birte","Hollensteiner","BV Sennestadt","","","","","","","BV Sennestadt e. V."]
[66869,"Sm 2","Dieter","Hollwedel","MGV Bremen","Ja","","","","","","Miniatur-Golf-Verein Bremen e. V."]
[41042,"Sm 2","Alfred","Höltgen","BGS Hardenberg","","","","","","","BGS Hardenberg-Pötter e. V."]
[22778,"Sw 2","Gudrun","Höltgen","BGS Hardenberg","","","","","","","BGS Hardenberg-Pötter e. V."]
[67827,"Sm 1","Marcus","Holtmann","CGC Hamm","","","","","","","Cobigolf-Verein Hamm 2019 e. V."]
[37720,"H","Frederik","Holtz","MC Rheinhausen","","","","","","","1. Minigolf-Club Rheinhausen e. V."]
[42793,"Sm 1","Edgar","Holtz","MC Rheinhausen","","","","","","","1. Minigolf-Club Rheinhausen e. V."]
[38028,"Sm 2","Peter","Holtz","MC Rheinhausen","","","","","","","1. Minigolf-Club Rheinhausen e. V."]
[67584,"Sw 2","Ursula","Holtzmann","MGC Köln","","","","","","","1. Minigolf-Club Köln 1961 e. V."]
[67439,"Sm 2","Ulrich","Holz","PTSV Hof","","","","","","","Post- und Telekom-Sportverein Hof e. V. Abteilung Minigolf "]
[66732,"H","Sascha","Holzenthal","MGC Mainz","","","","","","","Erster Mainzer Minigolf-Club e. V. 1964"]
[5746,"Sm 2","Lothar","Homey","Essener CGC","","","","","","","1. Essener cobiGOLF - Club \"Blau-Gold\" e. V."]
[67033,"Sm 2","Wolfgang","Hommel","MGC Olympia Kiel","","","","","","","Miniaturgolfclub Olympia Kiel e. V."]
[37494,"Sm 1","Frank","Honerkamp","Bochumer MC","","","","","","","Bochumer Minigolf-Club 1960 e. V."]
[63691,"H","Ronny","Hönicke","MGC Bad Bocklet","","","","","","","Miniatur-Golf-Club \"Stahlquelle\", Bad Bocklet 1989 e. V."]
[63702,"H","Marcel","Hönicke","MGC Bad Bocklet","","","","","","","Miniatur-Golf-Club \"Stahlquelle\", Bad Bocklet 1989 e. V."]
[66357,"Sm 1","Marco","Hönicke","MGC Bad Bocklet","","","","","","","Miniatur-Golf-Club \"Stahlquelle\", Bad Bocklet 1989 e. V."]
[49860,"Sm 2","Ludger","Honnacker","MGC Felderbachtal","","","","","","","Minigolf-Club-Felderbachtal 1964 e. V."]
[23187,"Sm 2","Peter","Honnef","MGC Ludwigshafen","","","","","","","1. Miniatur-Golf-Club Ludwigshafen 1964 e. V."]
[36467,"Sm 2","Karl Heinz","Hönscheid","BGC Weseling","","","","","","","1. Bahnen-Golf-Club Wesseling 1975 e. V. "]
[66979,"Jm","Luca","Hoock","MGC Ludwigshafen","","","","","","","1. Miniatur-Golf-Club Ludwigshafen 1964 e. V."]
[30377,"H","Björn","Hoogen","VfB Osnabrück","","","","","","","Verein für Bahnengolf Osnabrück von 1984 e. V."]
[48944,"H","Ingo","Hoogen","VfB Osnabrück","","","","","","","Verein für Bahnengolf Osnabrück von 1984 e. V."]
[66793,"Jw","Lena","Hoogen","VfB Osnabrück","","","","","","","Verein für Bahnengolf Osnabrück von 1984 e. V."]
[67430,"Schm","Hendrik","Hoogen","VfB Osnabrück","","","","","","","Verein für Bahnengolf Osnabrück von 1984 e. V."]
[40538,"Sm 2","Wilfried","Hoose","BGS Hardenberg","","","","","","","BGS Hardenberg-Pötter e. V."]
[30608,"Sm 1","Bernhard","Höötmann","BGC Hannover","Ja","","","","","","1. Bahnen-Golf-Club Hannover e. V."]
[35130,"Sm 1","Carsten","Höpfner","BGC Northeim","Ja","","","","","","Bahnen-Golf-Club Northeim e. V."]
[40166,"Sm 1","Mario","Höpfner","TSV Kücknitz","","","","","","","Turn - und Sportverein Kücknitz von 1911 e. V. Abteilung Bahnengolf"]
[46612,"Sm 2","Peter","Höpner","BGS Hardenberg","","","","","","","BGS Hardenberg-Pötter e. V."]
[37752,"Sm 1","Mike","Hoppe","MGF Magdeburg","","","","","","","Minigolffreunde Magdeburg e. V."]
[67299,"Sm 1","Daniel","Hoppe","CGC Hamm","","","","","","","Cobigolf-Verein Hamm 2019 e. V."]
[42335,"Sm 2","Alexander","Horbas","MGC Ingolstadt","","","","","",""," Miniaturgolf-Club Ingolstadt e. V."]
[67186,"Jm","Benedikt","Hörburger","MSG Kempten","","","","","","","Minigolf-Sport-Gemeinschaft Kempten e. V."]
[38145,"Sw 1","Claudia","Horeis","MGC Bergisch Gladbach","","","","","","","Minigolf-Club Bergisch Gladbach Gierath e. V."]
[38146,"Sm 2","Kai","Horeis","MGC Bergisch Gladbach","","","","","","","Minigolf-Club Bergisch Gladbach Gierath e. V."]
[27888,"H","Armin","Hörl","MGF Hammer","","","","","","","Minigolffreunde Hammer e. V."]
[50002,"Sm 2","Dennis","Horn","BGC Diepholz","Ja","","","","","","Bahnen-Golf-Club Diepholz e. V."]
[45305,"Sm 1","Frank","Hornberger","SV Lurup","","","","","","","Sportverein Lurup-Hamburg von 1923 e. V. Abteilung Bahnengolf"]
[33961,"Sm 2","Gerhard","Horsinka","MC Elmshorn","","","","","","","Minigolf-Club Flora Elmshorn e. V."]
[38121,"H","Valentin","Horst","SG Arheilgen","","","","","","","Sportgemeinschaft Arheilgen 1876/1945 e. V. Abteilung Bahnengolf"]
[67697,"Jm","Benedikt","Hößl","Münchener MC","","","","","","","1. Münchener Minigolf-Club 1962 e. V."]
[67088,"H","Matthis","Hötzel","BGSV Castrop","","","","","","","Bahnengolfsportverein Castrop e. V. 1961"]
[24610,"H","Kai","Hövel","VfM Bottrop","","","","","","","Verein für Minigolf Bottrop e. V."]
[38389,"H","Eric","Huber","BSV Bad Homburg","","","","","","","Bahnengolf-Sportverein Bad Homburg v.d.H. e. V."]
[38355,"H","Ronny","Huber","BGC Heilbronn","","","","","","","Bahnengolf Club Heilbronn e. V."]
[47050,"Sm 1","Klaus","Huber","MGC Wolnzach","","","","","","","Miniaturgolf-Club Wolnzach e. V."]
[48107,"Sm 2","Karl-Heinz","Huber","BGC Landshut","","","","","","","1. Bahnengolf-Club Landshut e. V."]
[66882,"Jm","Kevin","Hubrecht","MC Elmshorn","","","","","","","Minigolf-Club Flora Elmshorn e. V."]
[32871,"Sm 1","Peter","Hubrecht","MC Elmshorn","","","","","","","Minigolf-Club Flora Elmshorn e. V."]
[67248,"H","Luca","Hudert","BSV Bad Homburg","","","","","","","Bahnengolf-Sportverein Bad Homburg v.d.H. e. V."]
[33867,"Sm 2","Karl-Heinz","Hufnagl","MGC Ingolstadt","","","","","",""," Miniaturgolf-Club Ingolstadt e. V."]
[7524,"Sm 2","Klaus","Hufschmidt","BGSC Gladbeck","","","","","","","Bahnengolfsportclub \"Gut Schlag\" Gladbeck e. V."]
[30013,"H","Michael","Huhn",{"$f":"VLOOKUP(L1346,Kurznamen,2,0)","v":"BGC Heilbronn"},{"$f":"IF(VLOOKUP(L1346,Kurznamen,3,0)=\"Ja\",\"Ja\",\"\")","v":""},"","","","","","Bahnengolf Club Heilbronn e. V."]
[6300,"Sm 2","Klaus","Huhn","BGC Heilbronn","","","","","","","Bahnengolf Club Heilbronn e. V."]
[47019,"Sw 2","Martina","Huhn","BGC Bad Mergentheim","","","","","","","Bahnen-Golf-Club Bad Mergentheim e. V."]
[49297,"Sm 2","Wolfgang","Hühne","MGC Kassel","Ja","","","","","","1. Mini-Golfsport-Club Kassel-Vellmar 1964 e. V."]
[67802,"Schm","Ben","Humann","BGSC Gladbeck","","","","","","","Bahnengolfsportclub \"Gut Schlag\" Gladbeck e. V."]
[32803,"H","Marcell","Humbek","MGC Bad Bocklet","","","","","","","Miniatur-Golf-Club \"Stahlquelle\", Bad Bocklet 1989 e. V."]
[36485,"H","Sascha-Nico","Humbek","MGC Bad Bocklet","","","","","","","Miniatur-Golf-Club \"Stahlquelle\", Bad Bocklet 1989 e. V."]
[63553,"D","Jeanette","Humbek-Hönicke","MGC Bad Bocklet","","","","","","","Miniatur-Golf-Club \"Stahlquelle\", Bad Bocklet 1989 e. V."]
[67010,"Sm 2","Dieter","Hundt","SSC Attendorn","","","","","","","Sterngolf-Sport-Club Attendorn e. V."]
[44723,"Sm 1","Karl-Heinz","Hunte","BGC Diepholz","Ja","","","","","","Bahnen-Golf-Club Diepholz e. V."]
[40603,"Sw 1","Stefanie","Hunte","BGC Diepholz","Ja",16468,"","X","","","Bahnen-Golf-Club Diepholz e. V."]
[5258,"Sm 2","Josef","Hupfloher","Münchener MC","","","","","","","1. Münchener Minigolf-Club 1962 e. V."]
[65120,"Sm 2","Norbert","Hupka","MGC Bad Homburg","","","","","","","Minigolf-Club Bad Homburg e. V."]
[27615,"Sm 1","Martin","Hüppen","Bochumer MC","","","","","","","Bochumer Minigolf-Club 1960 e. V."]
[46235,"Sm 1","Ulrich","Hürter","MSC Bad Godesberg","","","","","","","Minigolf-Sport-Club Bad Godesberg e. V."]
[66173,"Sm 2","Fred","Huse","Elbhavelland","","","","","","","Elbhavelland e. V. Abteilung Minigolfsport"]
[35406,"H","Marcel","Hüsges","MC Möve Cuxhaven","Ja","","","","","","Miniaturgolf-Club \"Möve\" Cuxhaven-Sahlenburg e. V."]
[67058,"Sm 1","Ralf","Hüther","MGC Heringen","","","","","","","Miniatur-Golf-Club Heringen e. V."]
[40165,"H","Marcel","Hütter","Duisburger MC","","","","","","","1. Duisburger Minigolf Club 1962 e. V."]
[38569,"D","Natascha","Hütter","Duisburger MC","","","","","","","1. Duisburger Minigolf Club 1962 e. V."]
[4182,"Sw 2","Anneliese","Hutzler","NMC Kelheim","","","","","","","1. Niederbayerischer Minigolf-Club Kelheim e. V."]
[38269,"Sm 1","Marcus","Hylak","MSC Bad Godesberg","","","","","","","Minigolf-Sport-Club Bad Godesberg e. V."]
[26659,"Sw 2","Reinhild","Hylak","MSC Bad Godesberg","","","","","","","Minigolf-Sport-Club Bad Godesberg e. V."]
[35568,"D","Marina","Iffland","MGC Wanne-Eickel","","","","","","","Minigolfclub Rot-Weiß Wanne-Eickel e. V."]
[35239,"Sm 2","Peter","Iffland","MGC Wanne-Eickel","","","","","","","Minigolfclub Rot-Weiß Wanne-Eickel e. V."]
[67725,"Sm 2","Martin ","Ihm","MGC Bergisch Gladbach","","","","","","","Minigolf-Club Bergisch Gladbach Gierath e. V."]
[16225,"H","Marcus","Ihrlich","TSV Kücknitz","","","","","","","Turn - und Sportverein Kücknitz von 1911 e. V. Abteilung Bahnengolf"]
[48686,"Sm 1","Thomas","Ill","MGC Ravensburg","","","","","","","MGC Ravensburg-Weingarten e. V."]
[26834,"Sm 2","Alfred","Inck","MGC Bergisch Gladbach","","","","","","","Minigolf-Club Bergisch Gladbach Gierath e. V."]
[44954,"Sw 2","Alwine","Inck","MGC Bergisch Gladbach","","","","","","","Minigolf-Club Bergisch Gladbach Gierath e. V."]
[67771,"H","Dominik","Ingenpass","MGC Georgsmarienhütte","","","","","","","Minigolf-Club Georgsmarienhütte e. V."]
[27702,"Sm 2","Bruno","Ingenston","Berliner MSC","","","","","","","1. Berliner Miniaturgolf-Sportclub e. V. 1960"]
[61325,"Sw 2","Rose-Marie","Ipach","MGC Brunsbüttel","","","","","","","Miniaturgolf-Club Brunsbüttel e. V."]
[87517,"Sm 2","Heinz","Isbaner","BGC Oberhausen","","","","","","","Bahnengolf-Club Oberhausen e. V."]
[40541,"Sm 1","Oliver","Isenbiel","MSC Bensheim-Auerbach","","","","","","","Minigolf-Sport-Club Bensheim-Auerbach e. V."]
[33586,"Sw 1","Marion","Isop","VfL Lohbrügge","","","","","","","Verein für Leibesübungen Lohbrügge von 1892 e. V. Abteilung Bahnengolf"]
[63326,"Sm 2","Werner","Isselmann","MSC Wesel","","","","","","","1. Minigolf-Sportclub Wesel 66 66 e. V. "]
[46453,"Sm 1","Marcus","Itjen","MC Möve Cuxhaven","Ja","","","","","","Miniaturgolf-Club \"Möve\" Cuxhaven-Sahlenburg e. V."]
[66797,"H","Patrick","Itter","BGC Neutraubling","","","","","","","Bahnengolf-Club Neutraubling e. V."]
[30373,"Sm 1","Holger","Ittner","MSK Neheim-Hüsten","","","","","","","MINIGOLF-SPORT-KLUB Neheim-Hüsten e. V."]
[66406,"Sm 2","Peter","Izelle","BSC Ennepetal","","","","","","","Bahngolf-Sport-Club Ennepetal e. V."]
[43158,"Sm 1","Ingo","Jablonowski","BGC Bochum","","","","","","","Bahnengolf-Sportclub Bochum 1978 e. V."]
[46049,"Sm 1","Jesko","Jachens","MGC Olympia Kiel","","","","","","","Miniaturgolfclub Olympia Kiel e. V."]
[18069,"Sm 2","Franz","Jachert","MGC Süßen","","","","","","","1. Miniaturgolfclub Süßen e. V."]
[33011,"H","Christopher","Jäck","BGC Singen","","","","","","","1. Bahnengolf-Club Singen e. V."]
[34687,"Sm 2","Wolfram","Jäck","MGF Hilzingen","","","","","","","Minigolffreunde Hilzingen 80 e. V."]
[66462,"Jw","Joelina","Jacobi","MGC Bad Salzuflen","","","","","","","Minigolf-Club Bad Salzuflen e. V."]
[47260,"Sm 1","Frank","Jacobi","MGC Bad Salzuflen","","","","","","","Minigolf-Club Bad Salzuflen e. V."]
[35705,"Sw 1","Sabine","Jacobi","MGC Bad Salzuflen","","","","","","","Minigolf-Club Bad Salzuflen e. V."]
[35317,"H","Marco","Jacobs","TSV Arendsee","","","","","","","Turn- und Sportverein Arendsee e. V. Abteilung Minigolf"]
[1742,"Sm 1","Ralf","Jacobs","TSV Arendsee","","","","","","","Turn- und Sportverein Arendsee e. V. Abteilung Minigolf"]
[35316,"Sm 1","Jörg","Jacobs","TSV Arendsee","","","","","","","Turn- und Sportverein Arendsee e. V. Abteilung Minigolf"]
[6372,"Sm 2","Peter","Jäger","BGC Landshut","","","","","","","1. Bahnengolf-Club Landshut e. V."]
[40980,"Sm 2","Michael","Jäger","BSV Bad Homburg","","","","","","","Bahnengolf-Sportverein Bad Homburg v.d.H. e. V."]
[38313,"Sw 2","Gisela","Jäger","Rot-Weiß Syburg","","","","","","","Rot-Weiß Syburg 1960 e. V."]
[42951,"Sm 1","Achim","Jahr","MGC Oberkochen","","","","","","","Miniatur-Golfclub Oberkochen 1972 e. V."]
[24925,"Sm 2","Konrad","Jahr","MGC Göttingen","Ja","","","","","","1. Miniatur-Golfsport-Club 1970 Göttingen e. V."]
[44499,"Sw 2","Uta","Jahrmärker","BGC Celle","Ja",18570,"","X","","","1. Bahnen-Golf-Club Celle von 1964 e. V."]
[45789,"Sm 1","Christian","Jäink","MSK Neheim-Hüsten","","","","","","","MINIGOLF-SPORT-KLUB Neheim-Hüsten e. V."]
[66863,"H","Andre","Jaiser","SSV Ulm","","","","","","","Schwimm- und Sportverein Ulm 1846 e. V. Abteilung Bahnengolf"]
[66485,"Sm 2","Rudi","Jakab","BGC Bad Füssing","","","","","","","1. Bahnengolfclub Bad Füssing e. V."]
[41217,"Sm 2","Franz","Jakob","MGC Ingolstadt","","","","","",""," Miniaturgolf-Club Ingolstadt e. V."]
[66119,"Sm 2","Norbert","Jakob","BSV Bad Homburg","","","","","","","Bahnengolf-Sportverein Bad Homburg v.d.H. e. V."]
[67141,"H","Jens","Jakobs","MGC Traben-Trarbach","","","","","","","Minigolfclub Traben-Trarbach e. V."]
[33405,"H","Timo","Jakoby",{"$f":"VLOOKUP(L1410,Kurznamen,2,0)","v":"MGC Traben-Trarbach"},{"$f":"IF(VLOOKUP(L1410,Kurznamen,3,0)=\"Ja\",\"Ja\",\"\")","v":""},"","","","","","Minigolfclub Traben-Trarbach e. V."]
[66652,"Sm 1","Rene","Jakubeit","VfL Lüneburg","Ja","","","","","","Verein für Leibesübungen Lüneburg e. V. Abteilung Bahnengolf"]
[67208,"D","Janine","Jander","MGC Marl","","","","","","","Mini Golf Club Marl 1960 e. V."]
[67556,"D","Karolína","Jandová","BGC Neutraubling","","","","","","","Bahnengolf-Club Neutraubling e. V."]
[29585,"Sm 1","André","Jänicke","MGC Dormagen-Brechten","","","","","","","Minigolfclub Dormagen - Brechten e. V."]
[37822,"H","Andreas","Jansen","MGC Bergisch Gladbach","","","","","","","Minigolf-Club Bergisch Gladbach Gierath e. V."]
[24340,"Sm 2","Jörg","Jansen","VfM Bottrop","","","","","","","Verein für Minigolf Bottrop e. V."]
[36046,"Sm 2","Thomas","Jansen","MGC Ingolstadt","","","","","",""," Miniaturgolf-Club Ingolstadt e. V."]
[31015,"Sm 1","Markus","Janßen","MGC Mainz","","","","","","","Erster Mainzer Minigolf-Club e. V. 1964"]
[66147,"Sw 2","Petra","Janßen","SV Lurup","","","","","","","Sportverein Lurup-Hamburg von 1923 e. V. Abteilung Bahnengolf"]
[67236,"H","Sven","Janz","CGC Grötzingen","","","","","","","COBI-GOLF-CLUB Blau-Gelb Grötzingen 1968 e. V."]
[29771,"Sm 1","Klaus","Jarosch","VfM Bottrop","","","","","","","Verein für Minigolf Bottrop e. V."]
[34756,"Sw 2","Monika","Jarzembowski","MGC Olympia Kiel","","","","","","","Miniaturgolfclub Olympia Kiel e. V."]
[37433,"Sm 1","Alexander","Jasper","MGC Dormagen-Brechten","","","","","","","Minigolfclub Dormagen - Brechten e. V."]
[66179,"H","Jens","Jatho","BGC Hannover","Ja","","","","","","1. Bahnen-Golf-Club Hannover e. V."]
[66845,"Sm 1","Michael","Jauernek","MGC Monrepos","","","","","","","Minigolfclub Monrepos e. V."]
[66825,"H","Martin","Jecny","BGS Hardenberg","","","","","","","BGS Hardenberg-Pötter e. V."]
[50226,"Sm 1","Frank","Jende","MSC Bensheim-Auerbach","","","","","","","Minigolf-Sport-Club Bensheim-Auerbach e. V."]
[67772,"Sw 1","Antje","Jende","MSC Bensheim-Auerbach","","","","","","","Minigolf-Sport-Club Bensheim-Auerbach e. V."]
[46846,"Sm 1","André","Jensen","MGC Olympia Kiel","","","","","","","Miniaturgolfclub Olympia Kiel e. V."]
[33394,"Sm 1","Bernd","Jentschke","MGC Unterschneidheim","","","","","","","Minigolfclub Unterschneidheim e. V."]
[34568,"H","Sebastian","Jeschke","MSC Bad Godesberg","","","","","","","Minigolf-Sport-Club Bad Godesberg e. V."]
[36293,"D","Anna","Jeske","SV Lurup","","","","","","","Sportverein Lurup-Hamburg von 1923 e. V. Abteilung Bahnengolf"]
[61958,"Sw 2","Marie-Luise","Jezierski","MGC Witten","","","","","","","Minigolfclub \"AS\" Witten 1963 e. V."]
[26456,"Sm 2","Erwin","Joachimsthaler","BGC Schweinfurt","","","","","","","Bahnengolfclub Schweinfurt e. V."]
[67682,"Sm 1","Páris","Joao","MGC Ingolstadt","","","","","",""," Miniaturgolf-Club Ingolstadt e. V."]
[67792,"H","Niklas","Joch","BSV Bad Homburg","","","","","","","Bahnengolf-Sportverein Bad Homburg v.d.H. e. V."]
[67793,"Sm 1","Peter","Joch","BSV Bad Homburg","","","","","","","Bahnengolf-Sportverein Bad Homburg v.d.H. e. V."]
[46843,"Sm 1","Niels","Johannsen","MGC Bad Oldesloe","","","","","","","Miniaturgolfclub Bad Oldesloe von 1964 e. V."]
[40896,"Sm 2","Manfred","Jöhrens","BGC Hannover","Ja","","","","","","1. Bahnen-Golf-Club Hannover e. V."]
[28802,"Sw 1","Melanie","Jooß","BGC Illertissen","","","","","","","Bahnengolfclub Illertissen e. V."]
[28793,"Sm 2","Thomas","Jooß","BGC Illertissen","","","","","","","Bahnengolfclub Illertissen e. V."]
[67200,"Sm 1","Oliver","Jordan","BSV Bad Homburg","","","","","","","Bahnengolf-Sportverein Bad Homburg v.d.H. e. V."]
[40687,"Sm 1","Nikolai","Juchem","MGC Mainz","","","","","","","Erster Mainzer Minigolf-Club e. V. 1964"]
[37937,"H","Marco","Jung","MGC Murnau","","","","","","","Minigolfclub Murnau am Staffelsee e. V."]
[30969,"D","Claudia","Jung","MGC Murnau","","","","","","","Minigolfclub Murnau am Staffelsee e. V."]
[66017,"D","Johanna","Jung","KC Homburg","","","","","","","1. Kleingolf Club Homburg-Saar 1967 e. V."]
[40003,"Sm 1","Markus","Jung","BGV Bergisch Land","","","","","","","Bahnengolf-Verein Bergisch Land 1962/63 e. V."]
[67262,"Sw 1","Barbara","Jung","MGC Bad Bocklet","","","","","","","Miniatur-Golf-Club \"Stahlquelle\", Bad Bocklet 1989 e. V."]
[34878,"Sm 2","Horst","Jung","MSC Bensheim-Auerbach","","","","","","","Minigolf-Sport-Club Bensheim-Auerbach e. V."]
[66018,"Sm 2","Jürgen","Jung","KC Homburg","","","","","","","1. Kleingolf Club Homburg-Saar 1967 e. V."]
[3578,"Sw 2","Lieselotte","Jung","BGC Dormagen","","","","","","","Bahnengolf-Club Dormagen e. V."]
[66050,"Sm 1","Sven","Jungwirth","SSC Attendorn","","","","","","","Sterngolf-Sport-Club Attendorn e. V."]
[49073,"Sm 1","Alexander","Junkermann","MGC Dormagen-Brechten","","","","","","","Minigolfclub Dormagen - Brechten e. V."]
[38338,"D","Melanie","Jurgeleit","MGC Murnau","","","","","","","Minigolfclub Murnau am Staffelsee e. V."]
[38339,"Sw 1","Rebecca","Jurgeleit","BSV München","","","","","","","Bahnengolfsportverein 86 München e. V."]
[38337,"Sm 2","Bernd","Jurgeleit","BSV München","","","","","","","Bahnengolfsportverein 86 München e. V."]
[66717,"Sm 1","Klaus-Dieter","Jürgens","BGC Hannover","Ja","","","","","","1. Bahnen-Golf-Club Hannover e. V."]
[67142,"Jm","Jan Uwe","Jürgensen","SSV Ulm","","","","","","","Schwimm- und Sportverein Ulm 1846 e. V. Abteilung Bahnengolf"]
[43273,"Sm 1","Ralf","Jürgensen","SSV Ulm","","","","","","","Schwimm- und Sportverein Ulm 1846 e. V. Abteilung Bahnengolf"]
[67491,"Sw 1","Cornelia","Jürgensen","SSV Ulm","","","","","","","Schwimm- und Sportverein Ulm 1846 e. V. Abteilung Bahnengolf"]
[34656,"H","Heiko","Jürs","MC Elmshorn","","","","","","","Minigolf-Club Flora Elmshorn e. V."]
[65559,"H","Daniel","Jürs","MC Elmshorn","","","","","","","Minigolf-Club Flora Elmshorn e. V."]
[46052,"Sm 1","Mario","Jürs","MC Elmshorn","","","","","","","Minigolf-Club Flora Elmshorn e. V."]
[43508,"Sm 2","Dieter","Jürs","MC Elmshorn","","","","","","","Minigolf-Club Flora Elmshorn e. V."]
[43515,"Sw 2","Gabriele","Jürs","MC Elmshorn","","","","","","","Minigolf-Club Flora Elmshorn e. V."]
[29850,"Sm 1","Michael","Just","MGC Süßen","","","","","","","1. Miniaturgolfclub Süßen e. V."]
[66282,"H","Stephan","Jütte","MGC Paderborn","","","","","","","1. Minigolf-Club Paderborn 1980 e. V."]
[37468,"Sw 1","Annette","Kaestner","Reinickendorfer MGC","","","","","","","Reinickendorfer Miniatur - Golfsport - Club e. V."]
[46699,"Sm 1","Thomas","Kaiser","MSF Brilon","","","","","","","Minigolfsportfreunde Brilon e. V."]
[35182,"Sm 2","Herbert","Kaiser","BSV München","","","","","","","Bahnengolfsportverein 86 München e. V."]
[43405,"Sm 2","Michael","Kaiser","BSV Bad Homburg","","","","","","","Bahnengolf-Sportverein Bad Homburg v.d.H. e. V."]
[66302,"Sm 2","Alois","Kaisr","BSV Asslar","","","","","","","Bahnengolf-Sportverein Aßlar 1987 e. V."]
[66290,"H","Lukas","Kalb","MGC Murnau","","","","","","","Minigolfclub Murnau am Staffelsee e. V."]
[4222,"Sw 2","Anna","Kalhöfer",{"$f":"VLOOKUP(L1474,Kurznamen,2,0)","v":"MGC Witten"},{"$f":"IF(VLOOKUP(L1474,Kurznamen,3,0)=\"Ja\",\"Ja\",\"\")","v":""},"","","","","","Minigolfclub \"AS\" Witten 1963 e. V."]
[4455,"Sm 2","Manfred","Kalisch","BSV Asslar","","","","","","","Bahnengolf-Sportverein Aßlar 1987 e. V."]
[42648,"Sm 1","Roland","Kalka","MSK Olching","","","","","","","Olchinger Minigolf Sport Klub e. V."]
[34231,"D","Antje","Kalkbrenner","MGC Bad Salzuflen","","","","","","","Minigolf-Club Bad Salzuflen e. V."]
[67360,"Sw 1","Katja","Kammermaier","BSV München","","","","","","","Bahnengolfsportverein 86 München e. V."]
[35257,"Sw 2","Cornelia","Kampe","TSV Salzgitter","Ja","","","","","","Turn- und Sportverein Salzgitter e. V. Abteilung Bahnengolf"]
[45597,"Sm 1","Michael","Kampmann","MGC Bad Salzuflen","","","","","","","Minigolf-Club Bad Salzuflen e. V."]
[67662,"Sw 2","Sabine","Kampmann","BGV Backumer Tal","","","","","","","BGV Backumer Tal Herten e. V."]
[65827,"H","Jan-Kevin","Kampschulte","SSC Attendorn","","","","","","","Sterngolf-Sport-Club Attendorn e. V."]
[40227,"Sm 1","Frank","Kampschulte","MSC Herscheid","","","","","","","Minigolf-Sportclub Herscheid 1963 e. V."]
[66910,"Jm","Hannes","Kandert","TG Höchberg","","","","","","","Turngemeinde Höchberg von 1862 Bahnengolf e. V."]
[38341,"Sm 2","Harald","Kantor","BSV Bad Homburg","","","","","","","Bahnengolf-Sportverein Bad Homburg v.d.H. e. V."]
[44501,"Sm 1","Ralf","Kapelle","BGC Celle","Ja","","","","","","1. Bahnen-Golf-Club Celle von 1964 e. V."]
[35774,"H","Dennis","Kapke","MGC Dormagen-Brechten","","","","","","","Minigolfclub Dormagen - Brechten e. V."]
[28575,"Sw 2","Gabriele","Karas","MSC Neu-Wulstorf","","","","","","","1. Minigolf-Sport-Club Hamburg-Neu-Wulmstorf e. V."]
[29752,"Sm 1","Bruno","Karcher","MGC Tuttlingen","","","","","","","Erster Minigolf - Club Tuttlingen e. V."]
[29374,"Sm 1","Jürgen","Karl","MC Ilvesheim","","","","","","","Miniaturgolf-Club Ilvesheim e. V."]
[25466,"Sm 2","Klaus","Karlitschek","MGC Metzingen","","","","","","","1. Miniaturgolf Club Metzingen e. V."]
[18344,"Sm 2","Winfried","Karpa","BGV Backumer Tal","","","","","","","BGV Backumer Tal Herten e. V."]
[27122,"Sm 2","Detlef","Kasburg","MGC Peine","Ja","","","","","","1. Miniaturgolf-Club Peine von 1965 e. V."]
[67468,"Schm","Sky Joèl","Kaspar","BGC Bildstock","","","","","","","Bahnen-Golf-Club Bildstock e. V."]
[30576,"Sm 1","Stefan","Kaspar","BSV Ohlsbach","","","","","","","Bahnengolfsportverein 82 Ohlsbach e. V."]
[67820,"Schm","Jan","Kasper","MGC Paderborn","","","","","","","1. Minigolf-Club Paderborn 1980 e. V."]
[34120,"Sm 2","Harald","Kaßner","SC Bad Münder","Ja","","","","","","Sportclub Bad Münder e. V. Abteilung Bahnengolf"]
[38144,"Sm 1","Holger","Kastner","MSC Wesel","","","","","","","1. Minigolf-Sportclub Wesel 66 66 e. V. "]
[67235,"H","Fabian","Kauss","BGC Celle","Ja","","","","","","1. Bahnen-Golf-Club Celle von 1964 e. V."]
[31250,"Sm 2","Thomas","Kegel","MGC Ostheim/Rhön","","","","","","","Miniaturgolfclub Ostheim/Rhön e. V. "]
[26465,"Sm 2","Roland","Kehl","SGC Hagen","","","","","","","Sterngolf-Club Hagen e. V."]
[30337,"Sm 1","Karsten","Kehr","BGC Northeim","Ja","","","","","","Bahnen-Golf-Club Northeim e. V."]
[6360,"Sm 2","Hermann","Kehrer","MGC Metzingen","","","","","","","1. Miniaturgolf Club Metzingen e. V."]
[46465,"H","Sven","Keiper","FZC Bliesen","","","","","","","Freizeit Club Bliesen e. V."]
[67351,"Sw 1","Marita","Keith","MGC Heven","","","","","","","Miniatur - Golf - Club Heven e. V."]
[24022,"Sm 1","Andreas","Kelch","Tempelhofer MV","","","","","","","Tempelhofer Miniaturgolf Verein von 1965 e. V."]
[29738,"Sm 1","Frank","Keller","TG Höchberg","","","","","","","Turngemeinde Höchberg von 1862 Bahnengolf e. V."]
[67050,"Sm 1","Markus","Keller","BGV Backumer Tal","","","","","","","BGV Backumer Tal Herten e. V."]
[48285,"Sm 2","Franz","Keller","MGC Murnau","","","","","","","Minigolfclub Murnau am Staffelsee e. V."]
[19630,"Sm 2","Rudolf","Kellner","MGC Oberkochen","","","","","","","Miniatur-Golfclub Oberkochen 1972 e. V."]
[22366,"Sw 2","Karin","Kellner","MGC Oberkochen","","","","","","","Miniatur-Golfclub Oberkochen 1972 e. V."]
[50151,"H","Christian","Kemler","KGC Mönchengladbach","","","","","","","1. Klein-Golf-Club Mönchengladbach e. V."]
[30988,"Sm 1","Norbert","Kempa","SV Gebhardshagen","Ja","","","","","","SV Glück Auf 1901 Gebhardshagen e. V. Abteilung Minigolf"]
[955,"Sw 2","Marina","Kempa","SV Gebhardshagen","Ja","","","","","","SV Glück Auf 1901 Gebhardshagen e. V. Abteilung Minigolf"]
[26658,"Sm 2","Manfred","Kempen","MSC Bad Godesberg","","","","","","","Minigolf-Sport-Club Bad Godesberg e. V."]
[36920,"H","Markus","Kempf","BGSV Kerpen","","","","","","","Bahnen-Golf-Sport-Vereinigung Kerpen e. V."]
[38620,"Sm 2","Lutz","Kemsies","BSV Leipzig","","","","","","","BSV AOK Leipzig e. V."]
[66655,"Sw 2","Regine","Kemsies","BSV Leipzig","","","","","","","BSV AOK Leipzig e. V."]
[42407,"Sm 1","Udo","Keppler","MGC Süßen","","","","","","","1. Miniaturgolfclub Süßen e. V."]
[66536,"Sm 2","Jürgen","Kerk","Hamburger MC","","","","","","","Hamburger Minigolf Club von 1965 e. V."]
[67069,"H","Toni","Kersek","MSK Neheim-Hüsten","","","","","","","MINIGOLF-SPORT-KLUB Neheim-Hüsten e. V."]
[66397,"Sm 1","Jens","Kesting","Kölner MC","","","","","","","Kölner Miniatur Golf Club e. V."]
[48508,"Sm 1","Andreas","Kiefer","Tempelhofer MV","","","","","","","Tempelhofer Miniaturgolf Verein von 1965 e. V."]
[36169,"Sm 2","Peter","Kiehl","MGC Bad Soden","","","","","","","Miniaturgolfclub Bad Soden-Salmünster e. V."]
[4114,"Sm 2","Detlev","Kiesow","TSV Kücknitz","","","","","","","Turn - und Sportverein Kücknitz von 1911 e. V. Abteilung Bahnengolf"]
[38332,"Sm 2","Georg","Kießling","BGC Schweinfurt","","","","","","","Bahnengolfclub Schweinfurt e. V."]
[40792,"Sm 1","Thilo","Killmaier","MC Schriesheim","","","","","","","Miniaturgolf Sportclub Schriesheim e. V."]
[34130,"Sw 2","Christine","Killmaier","MC Schriesheim","","","","","","","Miniaturgolf Sportclub Schriesheim e. V."]
[41160,"Sm 1","Oliver","Kindermann","MGC Ludwigshafen","","","","","","","1. Miniatur-Golf-Club Ludwigshafen 1964 e. V."]
[155,"Sm 2","Jörg Rainer","Kindt","MSV Bad Kreuznach","","","","","","","MSV Bad Kreuznach e. V."]
[48544,"Sm 2","Jörg","Kinnemann","MGC Göttingen","Ja",20605,"","X","","","1. Miniatur-Golfsport-Club 1970 Göttingen e. V."]
[67629,"Schm","Maxim","Kipka","BGC Bremen","Ja","","","","","","Bahnen-Golf-Club Bremen e. V."]
[42971,"Sm 1","Rainer","Kirberg","HMC Büttgen","","","","","","","Hobbysport Miniaturgolfclub Büttgen e. V."]
[29886,"Sm 1","Manfred","Kirch","BGC Weseling","","","","","","","1. Bahnen-Golf-Club Wesseling 1975 e. V. "]
[67691,"Sm 1","Thomas","Kirchhöfer","CGC Groß-Umstadt","","","","","","","1. Cobigolf Club Rot-Weiß Groß-Umstadt e. V."]
[6110,"Sw 2","Dagmar","Kirchhoff-Freund","MGC Biebertal","","","","","","","Miniatur-Golf-Club Freizeitzentrum Biebertal e. V."]
[22103,"Sw 2","Helga","Kirgasser","MC Neuwied","","","","","","","Miniaturgolfclub Neuwied e. V."]
[67646,"Sm 1","Stefan","Kirmair",{"$f":"VLOOKUP(L1538,Kurznamen,2,0)","v":"MGC Diessen"},{"$f":"IF(VLOOKUP(L1538,Kurznamen,3,0)=\"Ja\",\"Ja\",\"\")","v":""},"","","","","","Minigolf-Club Diessen e. V."]
[36810,"Sm 2","Josef","Kirner","MGC Bad Feilnbach","","","","","","","Minigolfclub Bad Feilnbach e. V."]
[51586,"Sm 1","Stefan","Kirpal","BGC Bad Nenndorf","Ja","","","","","","Bahnen-Golf-Club Bad Nenndorf e. V."]
[38456,"Sm 2","Michael","Kirschke","Reinickendorfer MGC","","","","","","","Reinickendorfer Miniatur - Golfsport - Club e. V."]
[67338,"H","Tobias","Kirscht","MC Elmshorn","","","","","","","Minigolf-Club Flora Elmshorn e. V."]
[36686,"Sw 2","Rotraud","Kirstein","MSC Herscheid","","","","","","","Minigolf-Sportclub Herscheid 1963 e. V."]
[64051,"Sm 2","Emil","Kisel","MGF Kempten","","","","","","","Minigolf-Freunde Steinbruch Kempten e. V."]
[4892,"Sm 2","Franz","Kissenkötter","MGC Köln","","","","","","","1. Minigolf-Club Köln 1961 e. V."]
[67611,"Sm 1","Frank","Kissinger","MGF Magdeburg","","","","","","","Minigolffreunde Magdeburg e. V."]
[67184,"Jm","Lukas","Kitzeder","MSG Kempten","","","","","","","Minigolf-Sport-Gemeinschaft Kempten e. V."]
[41439,"Sm 1","Stefan","Kitzeder","MSG Kempten","","","","","","","Minigolf-Sport-Gemeinschaft Kempten e. V."]
[67642,"Sw 2","Bärbel","Kizinski","Elbhavelland","","","","","","","Elbhavelland e. V. Abteilung Minigolfsport"]
[36924,"Sm 1","Bernd","Klann","MGC Dormagen-Brechten","","","","","","","Minigolfclub Dormagen - Brechten e. V."]
[3832,"Sm 2","Gerd","Klär","FZC Bliesen","","","","","","","Freizeit Club Bliesen e. V."]
[67327,"Sm 2","Heribert","Klarhold","BGC Paderborn","","","","","","","1. Bahnengolfclub Paderborn e. V."]
[25842,"Sm 2","Heinz","Kläsgen","MGC Biebertal","","","","","","","Miniatur-Golf-Club Freizeitzentrum Biebertal e. V."]
[34826,"H","Oleg","Klassen","SG Arheilgen","","","","","","","Sportgemeinschaft Arheilgen 1876/1945 e. V. Abteilung Bahnengolf"]
[4690,"Sm 2","Walter","Klauke","MC Schriesheim","","","","","","","Miniaturgolf Sportclub Schriesheim e. V."]
[66582,"D","Liana","Klaus","BGC Bremen","Ja","","","","","","Bahnen-Golf-Club Bremen e. V."]
[66581,"Sm 1","Sven","Klaus","BGC Bremen","Ja","","","","","","Bahnen-Golf-Club Bremen e. V."]
[36946,"H","Michael","Klee","KC Homburg","","","","","","","1. Kleingolf Club Homburg-Saar 1967 e. V."]
[24092,"Sm 2","Hannes","Klee","MSC Bensheim-Auerbach","","","","","","","Minigolf-Sport-Club Bensheim-Auerbach e. V."]
[36072,"Sm 2","Wolfgang","Klee","KC Homburg","","","","","","","1. Kleingolf Club Homburg-Saar 1967 e. V."]
[48337,"H","Marcel","Klein","MGC putter Künzell","","","","","","","Minigolfclub putter Künzell 1970 e. V."]
[42309,"Sm 1","Chris","Klein","KC Homburg","","","","","","","1. Kleingolf Club Homburg-Saar 1967 e. V."]
[46240,"Sm 1","Detlef","Klein","MGC Bad Salzuflen","","","","","","","Minigolf-Club Bad Salzuflen e. V."]
[67464,"Sm 1","Michael","Klein","BGC Hannover","Ja","","","","","","1. Bahnen-Golf-Club Hannover e. V."]
[34233,"Sw 1","Kerstin","Klein","BGC Hannover","Ja",12337,"","X","","X","1. Bahnen-Golf-Club Hannover e. V."]
[36474,"Sw 1","Sabine","Klein","HMC Büttgen","","","","","","","Hobbysport Miniaturgolfclub Büttgen e. V."]
[42305,"Sw 1","Kerstin","Klein","MGC Bad Salzuflen","","","","","","","Minigolf-Club Bad Salzuflen e. V."]
[600,"Sm 2","Jürgen","Klein","VfB Osnabrück","","","","","","","Verein für Bahnengolf Osnabrück von 1984 e. V."]
[4762,"Sm 2","Helge","Klein","MSC Bad Godesberg","","","","","","","Minigolf-Sport-Club Bad Godesberg e. V."]
[7074,"Sm 2","Heinz Günter","Klein","KGC Mönchengladbach","","","","","","","1. Klein-Golf-Club Mönchengladbach e. V."]
[19531,"Sm 2","Peter","Klein","MC Ilvesheim","","","","","","","Miniaturgolf-Club Ilvesheim e. V."]
[36277,"Sm 2","Bernd","Klein","SSC Halver","","","","","","","SSC Halver e. V."]
[40219,"Sm 2","Theo","Klein","SSC Halver","","","","","","","SSC Halver e. V."]
[34653,"Sw 2","Antje","Klein","SC Neumünster","","","","","","","Sportclub Gut Heil Neumünster von 1881 e. V. Abteilung Miniaturgolf"]
[38462,"H","Tristan","Kleiner","MSC Wesel","","","","","","","1. Minigolf-Sportclub Wesel 66 66 e. V. "]
[38519,"H","Philipp","Kleiner","MSK Neheim-Hüsten","","","","","","","MINIGOLF-SPORT-KLUB Neheim-Hüsten e. V."]
[38606,"Sm 1","Bernward","Kleiner","BGC Hannover","Ja","","","","","","1. Bahnen-Golf-Club Hannover e. V."]
[38607,"Sw 1","Sabine","Kleiner","BGC Hannover","Ja","","","","","","1. Bahnen-Golf-Club Hannover e. V."]
[66947,"Jm","Robin","Kleinke","SSC Attendorn","","","","","","","Sterngolf-Sport-Club Attendorn e. V."]
[37962,"H","Marc Dominik","Klemm","KC Homburg","","","","","","","1. Kleingolf Club Homburg-Saar 1967 e. V."]
[67670,"H","André","Klemm","MGC Bad Homburg","","","","","","","Minigolf-Club Bad Homburg e. V."]
[67462,"Jm","Till","Klenzmann","BGC Hannover","Ja","","","","","","1. Bahnen-Golf-Club Hannover e. V."]
[67463,"Schm","Kai","Klenzmann","BGC Hannover","Ja","","","","","","1. Bahnen-Golf-Club Hannover e. V."]
[67232,"Jm","Felix","Klepzig","MGC Karlshagen","","","","","","","Minigolfclub Karlshagen e. V."]
[182,"Sm 2","Michael","Kleyer","BGSV Castrop","","","","","","","Bahnengolfsportverein Castrop e. V. 1961"]
[6025,"Sm 2","Erich","Kleyer","BGSV Castrop","","","","","","","Bahnengolfsportverein Castrop e. V. 1961"]
[67489,"Sw 1","Katja","Kling","MGC Tuttlingen","","","","","","","Erster Minigolf - Club Tuttlingen e. V."]
[66511,"Sm 2","Peter","Kling","BGC Bochum","","","","","","","Bahnengolf-Sportclub Bochum 1978 e. V."]
[66510,"Sw 2","Martina","Kling","BGC Bochum","","","","","","","Bahnengolf-Sportclub Bochum 1978 e. V."]
[65814,"H","Björn","Klingelhöfer","CGC Rauschenberg","","","","","","","Cobigolf-Club Rauschenberg e. V."]
[24658,"Sm 2","Wilfried","Klipp","BV Sennestadt","","","","","","","BV Sennestadt e. V."]
[66309,"Jm","Lauro","Klöckener","MSK Neheim-Hüsten","","","","","","","MINIGOLF-SPORT-KLUB Neheim-Hüsten e. V."]
[45785,"Sm 1","Sven","Klöckener","MSK Neheim-Hüsten","","","","","","","MINIGOLF-SPORT-KLUB Neheim-Hüsten e. V."]
[45786,"Sw 1","Astrid","Klöckener","MSK Neheim-Hüsten","","","","","","","MINIGOLF-SPORT-KLUB Neheim-Hüsten e. V."]
[5257,"Sw 2","Katharina","Klöhn","MSK Olching","","","","","","","Olchinger Minigolf Sport Klub e. V."]
[45781,"Sm 2","Olaf","Kloke","MSK Neheim-Hüsten","","","","","","","MINIGOLF-SPORT-KLUB Neheim-Hüsten e. V."]
[67750,"Schw","Chiara","Klopp","BGC Bildstock","","","","","","","Bahnen-Golf-Club Bildstock e. V."]
[33504,"H","Sebastian","Klosek","BGC Bad Nenndorf","Ja","","","","","","Bahnen-Golf-Club Bad Nenndorf e. V."]
[65955,"H","Sascha","Klotz","BSV Asslar","","","","","","","Bahnengolf-Sportverein Aßlar 1987 e. V."]
[33187,"Sm 1","Christian","Klotz","MGC Süßen","","","","","","","1. Miniaturgolfclub Süßen e. V."]
[35375,"Sw 1","Sandra","Klotz","MGC Süßen","","","","","","","1. Miniaturgolfclub Süßen e. V."]
[45514,"Sm 1","Matthias","Klug",{"$f":"VLOOKUP(L1602,Kurznamen,2,0)","v":"MGC Mainz"},{"$f":"IF(VLOOKUP(L1602,Kurznamen,3,0)=\"Ja\",\"Ja\",\"\")","v":""},"","","","","","Erster Mainzer Minigolf-Club e. V. 1964"]
[67769,"D","Yvonne ","Klukas","MGC Mainz","","","","","","","Erster Mainzer Minigolf-Club e. V. 1964"]
[43187,"Sm 1","Joachim","Knapp","SG Arheilgen","","","","","","","Sportgemeinschaft Arheilgen 1876/1945 e. V. Abteilung Bahnengolf"]
[413,"Sm 1","Ulrich","Kneer","MGC Paderborn","","","","","","","1. Minigolf-Club Paderborn 1980 e. V."]
[36090,"D","Vanessa","Knezevic","BGC Neutraubling","","","","","","","Bahnengolf-Club Neutraubling e. V."]
[41828,"Sw 1","Katja","Kniesch","BGC Hannover","Ja",17133,"","X","","X","1. Bahnen-Golf-Club Hannover e. V."]
[35356,"Sm 2","Dieter","Knietsch","MGC Peine","Ja","","","","","","1. Miniaturgolf-Club Peine von 1965 e. V."]
[35357,"Sw 2","Teresa","Knietsch","MGC Peine","Ja","","","","","","1. Miniaturgolf-Club Peine von 1965 e. V."]
[25352,"Sm 2","Ralf","Knippschild","MSC Wesel","","","","","","","1. Minigolf-Sportclub Wesel 66 66 e. V. "]
[38155,"Sm 1","Jan","Knoblauch","BGSC Gladbeck","","","","","","","Bahnengolfsportclub \"Gut Schlag\" Gladbeck e. V."]
[46684,"Sm 2","Wolfgang","Knoll","MC Ilvesheim","","","","","","","Miniaturgolf-Club Ilvesheim e. V."]
[35266,"Sw 2","Bianca","Knoll","MC Ilvesheim","","","","","","","Miniaturgolf-Club Ilvesheim e. V."]
[48641,"Sw 1","Nicole","Knöll-Grünenthal","TSV Pfungstadt","","","","","","","TSV Pfungstadt e. V. Abteilung Bahnengolf"]
[67658,"Sw 2","Klaudia","Knörle","BIG Ingelfingen","","","","","","","Bahnengolf Interessen-Gemeinschaft Ingelfingen 2020 e. V."]
[3935,"Sm 2","Helmut","Knott","BSV München","","","","","","","Bahnengolfsportverein 86 München e. V."]
[46124,"Sw 2","Irene","Knott","BSV München","","","","","","","Bahnengolfsportverein 86 München e. V."]
[67164,"Sm 1","Stefan","Knull","BV Sennestadt","","","","","","","BV Sennestadt e. V."]
[25613,"Sm 1","Uwe","Knust","BGC Bad Nenndorf","Ja",7574,"","X","","X","Bahnen-Golf-Club Bad Nenndorf e. V."]
[38374,"H","Philip","Kobbe","BGC Wolfsburg","Ja",26637,"X","","","","1. Bahnen - Golf - Club Wolfsburg e. V."]
[66636,"Sw 1","Marion","Kober","MSC Bensheim-Auerbach","","","","","","","Minigolf-Sport-Club Bensheim-Auerbach e. V."]
[21472,"Sm 1","Markus","Köberle","MGC Ladenburg","","","","","","","1. Miniaturgolf-Club Ladenburg e. V."]
[27551,"Sm 1","Roman","Kobisch","MGC Mainz","","","","","","","Erster Mainzer Minigolf-Club e. V. 1964"]
[27565,"Sw 1","Alice","Kobisch","MGC Mainz","","","","","","","Erster Mainzer Minigolf-Club e. V. 1964"]
[45575,"Sm 1","Robert","Koböck","MGF Hammer","","","","","","","Minigolffreunde Hammer e. V."]
[47206,"Sm 1","Konrad","Koböck","MGF Hammer","","","","","","","Minigolffreunde Hammer e. V."]
[66490,"H","Kevin","Koch","VfB Neugattersleben","","","","","","","VfB 21 Neugattersleben e. V."]
[66077,"D","Claudia","Koch","VfB Neugattersleben","","","","","","","VfB 21 Neugattersleben e. V."]
[67381,"Jm","Dennis","Koch","BSV Bad Homburg","","","","","","","Bahnengolf-Sportverein Bad Homburg v.d.H. e. V."]
[52103,"Sm 1","Jens","Koch","BGC Kiel-West","","","","","","","Bahnen-Golf-Club Kiel-West e. V."]
[67380,"Sm 1","Rolf","Koch","BSV Bad Homburg","","","","","","","Bahnengolf-Sportverein Bad Homburg v.d.H. e. V."]
[67594,"Sm 1","Stefan","Koch","MGC Würzburg","","","","","","","Miniaturgolfsportverein Würzburg - Löwenbrücke e. V."]
[43836,"Sw 1","Anja","Koch","MGC Brunsbüttel","","","","","","","Miniaturgolf-Club Brunsbüttel e. V."]
[67375,"Sm 2","Jürgen","Koch","KGC Mönchengladbach","","","","","","","1. Klein-Golf-Club Mönchengladbach e. V."]
[27674,"Sm 2","Klaus","Kocks","BGV Backumer Tal","","","","","","","BGV Backumer Tal Herten e. V."]
[3613,"Sm 2","Gerhard","Kofler","KGC Bad Urach","","","","","","","Klein-Golf-Club Bad Urach e. V."]
[35075,"H","Sven","Kohl","MGC Bad Soden","","","","","","","Miniaturgolfclub Bad Soden-Salmünster e. V."]
[66203,"H","Philipp","Köhler","BGC Heilbronn","","","","","","","Bahnengolf Club Heilbronn e. V."]
[18496,"Sm 2","Ulrich","Köhler","BSV München","","","","","","","Bahnengolfsportverein 86 München e. V."]
[50852,"Sm 2","Michael","Kohlhage","SSC Attendorn","","","","","","","Sterngolf-Sport-Club Attendorn e. V."]
[49559,"Sm 2","Michael","Kohnke","BGC Paffendorf","","","","","","","Bahnengolf Club Schloß Paffendorf e. V."]
[67786,"H","Jan","Kolenko","BGS Hardenberg","","","","","","","BGS Hardenberg-Pötter e. V."]
[4492,"Sm 2","Max","Koll","MC Lüdenscheid","","","","","","","MC 62 Lüdenscheid e. V."]
[36379,"Sw 2","Renate","Koll","MC Lüdenscheid","","","","","","","MC 62 Lüdenscheid e. V."]
[67137,"Sw 2","Jutta","Kolloff","SV Gebhardshagen","Ja","","","","","","SV Glück Auf 1901 Gebhardshagen e. V. Abteilung Minigolf"]
[61900,"Sm 2","Johann","Komurka","MGC Ladenburg","","","","","","","1. Miniaturgolf-Club Ladenburg e. V."]
[66181,"Sm 1","Bernd","Könemann","TSV Salzgitter","Ja","","","","","","Turn- und Sportverein Salzgitter e. V. Abteilung Bahnengolf"]
[66182,"Sw 1","Nicole","Könemann","TSV Salzgitter","Ja","","","","","","Turn- und Sportverein Salzgitter e. V. Abteilung Bahnengolf"]
[66968,"Jm","Joshua","Könen","MGC Bad Bodendorf","","","","","","","Miniaturgolfclub Bad Bodendorf e. V."]
[66151,"Sm 1","Stephan","Konieczny","MSC Bensheim-Auerbach","","","","","","","Minigolf-Sport-Club Bensheim-Auerbach e. V."]
[65818,"H","Kevin","König","BGC Singen","","","","","","","1. Bahnengolf-Club Singen e. V."]
[36548,"Sm 1","Bert","König","MC Rheinhausen","","","","","","","1. Minigolf-Club Rheinhausen e. V."]
[4539,"Sm 2","Wolfgang","König","MSC Neu-Wulstorf","","","","","","","1. Minigolf-Sport-Club Hamburg-Neu-Wulmstorf e. V."]
[21380,"Sm 2","Helmut","König","VfM Bottrop","","","","","","","Verein für Minigolf Bottrop e. V."]
[66051,"Sm 2","Erich","König","SSC Attendorn","","","","","","","Sterngolf-Sport-Club Attendorn e. V."]
[6233,"Sw 2","Hannelore","König","MSC Neu-Wulstorf","","","","","","","1. Minigolf-Sport-Club Hamburg-Neu-Wulmstorf e. V."]
[36196,"Sw 2","Beate","König","MC Rheinhausen","","","","","","","1. Minigolf-Club Rheinhausen e. V."]
[67057,"Sw 2","Irmtraud","König","MGC Heringen","","","","","","","Miniatur-Golf-Club Heringen e. V."]
[34127,"Sm 2","Peter","Konle","MGC Unterschneidheim","","","","","","","Minigolfclub Unterschneidheim e. V."]
[5696,"Sw 2","Ingeborg","Könnecke","BGC Ottobrunn","","","","","","","BGC 90 Ottobrunn e. V."]
[37506,"Sm 1","Günther","Konstanzer","MGC Hechingen","","","","","","","1. Minigolfclub Hechingen e. V."]
[37380,"Sm 2","Alfred","Konstanzer","MGC Metzingen","","","","","","","1. Miniaturgolf Club Metzingen e. V."]
[66828,"Jm","Nils","Körner","TSV Pfungstadt","","","","","","","TSV Pfungstadt e. V. Abteilung Bahnengolf"]
[5842,"Sm 2","Dieter","Körner","MGC Schwaikheim","","","","","","","Miniaturgolf – Club Schwaikheim e. V."]
[61974,"Sm 2","Hans","Koslowski","BGC Celle","Ja","","","","","","1. Bahnen-Golf-Club Celle von 1964 e. V."]
[44601,"Sm 2","Helmut","Kosmowski",{"$f":"VLOOKUP(L1666,Kurznamen,2,0)","v":"MGF Hilzingen"},{"$f":"IF(VLOOKUP(L1666,Kurznamen,3,0)=\"Ja\",\"Ja\",\"\")","v":""},"","","","","","Minigolffreunde Hilzingen 80 e. V."]
[23976,"Sm 2","Klaus","Kossmann","MSK Neheim-Hüsten","","","","","","","MINIGOLF-SPORT-KLUB Neheim-Hüsten e. V."]
[67502,"Sm 2","Ulrich","Koßmann","MGC Bad Salzuflen","","","","","","","Minigolf-Club Bad Salzuflen e. V."]
[67534,"Sw 2","Petra","Koßmann","MGC Bad Salzuflen","","","","","","","Minigolf-Club Bad Salzuflen e. V."]
[36868,"Sm 2","Mario","Kostack","MSG Kempten","","","","","","","Minigolf-Sport-Gemeinschaft Kempten e. V."]
[67152,"D","Sabine","Kottek","MGC Heven","","","","","","","Miniatur - Golf - Club Heven e. V."]
[42073,"Sw 1","Manuela","Köttel","ASV Pegnitz","","","","","","","Allgemeiner Sportverein Pegnitz e. V. Abteilung Minigolf"]
[44870,"Sm 2","Martin","Köttel","ASV Pegnitz","","","","","","","Allgemeiner Sportverein Pegnitz e. V. Abteilung Minigolf"]
[37199,"H","Christopher","Kottemer","MGF Magdeburg","","","","","","","Minigolffreunde Magdeburg e. V."]
[67179,"Sm 2","Chris","Kougioumtzidis","MGC Wanne-Eickel","","","","","","","Minigolfclub Rot-Weiß Wanne-Eickel e. V."]
[44018,"D","Elke","Kowatsch","BGC Bad Berneck","","","","","","","Bahnengolf-Club e. V. Bad Berneck"]
[46426,"D","Tanja","Koziol","MGC Bad Hersfeld","","","","","","","Miniatur-Golf-Club Bad Hersfeld e. V."]
[31769,"Sm 1","Michael","Koziol","BGS Hardenberg","","","","","","","BGS Hardenberg-Pötter e. V."]
[67077,"Sm 2","Herwart","Kraaz","MTV Seesen","",7972,"X","","","","Männer-Turn-Verein Seesen von 1862 e. V. Abteilung Bahnengolf"]
[40352,"Sm 2","Christian","Kracht","MGC Bad Salzuflen","","","","","","","Minigolf-Club Bad Salzuflen e. V."]
[20342,"Sm 2","Norbert","Kramer","MGC Mainz","","","","","","","Erster Mainzer Minigolf-Club e. V. 1964"]
[26346,"Sm 2","Michael","Kramer","BSV Leipzig","","","","","","","BSV AOK Leipzig e. V."]
[38200,"H","Sebastian","Krämer","MSC München","","","","","","","Minigolf-Sport-Club blau-weiß 2003 e. V. München"]
[44705,"Sm 1","Mathias","Krämer","MSC München","","","","","","","Minigolf-Sport-Club blau-weiß 2003 e. V. München"]
[50644,"Sw 1","Bärbel","Krämer","MSC München","","","","","","","Minigolf-Sport-Club blau-weiß 2003 e. V. München"]
[66222,"D","Melissa","Krane","MSK Neheim-Hüsten","","","","","","","MINIGOLF-SPORT-KLUB Neheim-Hüsten e. V."]
[38393,"D","Michaela","Krane","MSK Neheim-Hüsten","","","","","","","MINIGOLF-SPORT-KLUB Neheim-Hüsten e. V."]
[30374,"Sm 1","Jörg","Krane","MSK Neheim-Hüsten","","","","","","","MINIGOLF-SPORT-KLUB Neheim-Hüsten e. V."]
[43336,"Sw 1","Bettina","Krane","MSK Neheim-Hüsten","","","","","","","MINIGOLF-SPORT-KLUB Neheim-Hüsten e. V."]
[40222,"Sm 2","Ralf","Krane","MSK Neheim-Hüsten","","","","","","","MINIGOLF-SPORT-KLUB Neheim-Hüsten e. V."]
[26070,"Sm 1","Stephan","Kraus","Bochumer MC","","","","","","","Bochumer Minigolf-Club 1960 e. V."]
[67021,"H","Michel","Krause","Tempelhofer MV","","","","","","","Tempelhofer Miniaturgolf Verein von 1965 e. V."]
[67823,"D","Sophia","Krause","TSV Arendsee","","","","","","","Turn- und Sportverein Arendsee e. V. Abteilung Minigolf"]
[48931,"Sm 1","Dirk","Krause","BGC Celle","Ja",20839,"","X","","X","1. Bahnen-Golf-Club Celle von 1964 e. V."]
[24877,"Sm 2","Achim","Krause","BGC Dormagen","","","","","","","Bahnengolf-Club Dormagen e. V."]
[66161,"H","Silvio","Krauss","MGC Mainz","","","","","","","Erster Mainzer Minigolf-Club e. V. 1964"]
[66160,"D","Selina","Krauss","MGC Mainz","","","","","","","Erster Mainzer Minigolf-Club e. V. 1964"]
[66159,"Sw 1","Silvia","Krauss","MGC Mainz","","","","","","","Erster Mainzer Minigolf-Club e. V. 1964"]
[66158,"Sm 2","Siegfried","Krauss","MGC Mainz","","","","","","","Erster Mainzer Minigolf-Club e. V. 1964"]
[62949,"Sw 2","Hildegard","Krawutschke","NDE Miniaturgolf","","","","","","","Niendorfer Miniaturgolf-Club von 1963 e. V."]
[35302,"H","Tobias","Krebs","BGSV Castrop","","","","","","","Bahnengolfsportverein Castrop e. V. 1961"]
[38545,"Sw 1","Antje","Kreisheimer","MGC Bad Bocklet","","","","","","","Miniatur-Golf-Club \"Stahlquelle\", Bad Bocklet 1989 e. V."]
[38546,"Sm 2","Günther","Kreisheimer","MGC Bad Bocklet","","","","","","","Miniatur-Golf-Club \"Stahlquelle\", Bad Bocklet 1989 e. V."]
[36641,"H","Rene","Kreitz","MGC Göttingen","Ja","","","","","","1. Miniatur-Golfsport-Club 1970 Göttingen e. V."]
[66877,"Sm 2","Dieter","Kretschmer","Hamburger MC","","","","","","","Hamburger Minigolf Club von 1965 e. V."]
[34823,"Sm 2","Bernhard","Kreutter","MGF Waldshut","","","","","","","Minigolffreunde Waldshut 1974 e. V."]
[67436,"Sw 2","Inge","Kreutz","MGC Karlshagen","","","","","","","Minigolfclub Karlshagen e. V."]
[67657,"Schm","Niklas","Kreuzer","ASV Pegnitz","","","","","","","Allgemeiner Sportverein Pegnitz e. V. Abteilung Minigolf"]
[30925,"Sm 1","Andreas","Kreuzer","ASV Pegnitz","","","","","","","Allgemeiner Sportverein Pegnitz e. V. Abteilung Minigolf"]
[36156,"D","Tina","Kreuzer-Morgenstern","ASV Pegnitz","","","","","","","Allgemeiner Sportverein Pegnitz e. V. Abteilung Minigolf"]
[38453,"H","Thomas","Krieger","MGC München","","","","","","","1. Miniaturgolfclub München-Feldmoching e. V."]
[67353,"D","Simone","Krieger","BGS Hardenberg","","","","","","","BGS Hardenberg-Pötter e. V."]
[67089,"Jm","Leon","Krieger","BGS Hardenberg","","","","","","","BGS Hardenberg-Pötter e. V."]
[33310,"Sm 2","Gerhard","Krieger","MGC München","","","","","","","1. Miniaturgolfclub München-Feldmoching e. V."]
[35781,"Sm 2","Andreas","Krieger","BSV Bad Homburg","","","","","","","Bahnengolf-Sportverein Bad Homburg v.d.H. e. V."]
[66265,"Sm 2","Wolfgang","Krieger","RKV Rheinstetten","","","","","","","Rad- und Kraftfahrervereins \"Solidarität\" Mörsch e. V. Abteilung Minigolf Wölfe Rheinstetten 02"]
[40965,"Sw 1","Susanne","Kritsch","BGC Wolfsburg","Ja",16725,"","X","","","1. Bahnen - Golf - Club Wolfsburg e. V."]
[67696,"H","Gunter","Kröber","Münchener MC","","","","","","","1. Münchener Minigolf-Club 1962 e. V."]
[3168,"Sm 2","Erich","Kröger","MGC Brunsbüttel","","","","","","","Miniaturgolf-Club Brunsbüttel e. V."]
[36528,"Sm 2","Wolfgang","Kröger","TSV Kücknitz","","","","","","","Turn - und Sportverein Kücknitz von 1911 e. V. Abteilung Bahnengolf"]
[3116,"Sw 2","Maren","Kröger","MGC Brunsbüttel","","","","","","","Miniaturgolf-Club Brunsbüttel e. V."]
[3365,"Sm 2","Johann","Kröll","Porzer MGC","","","","","","","1. Porzer Minigolfclub Grün-Weiß 1969 e. V."]
[35332,"Sm 1","Manfred","Kronenberg","MGC Karlshagen","","","","","","","Minigolfclub Karlshagen e. V."]
[66824,"D","Susann","Kronschnabl","Münchener MC","","","","","","","1. Münchener Minigolf-Club 1962 e. V."]
[64901,"Schm","Florian","Kronschnabl","Münchener MC","","","","","","","1. Münchener Minigolf-Club 1962 e. V."]
[36647,"Sm 1","Manfred","Kronschnabl","Münchener MC","","","","","","","1. Münchener Minigolf-Club 1962 e. V."]
[67078,"Sm 1","Theo","Kronschnabl","BGC Illertissen","","","","","","","Bahnengolfclub Illertissen e. V."]
[17833,"Sm 2","Erwin","Kroßa","BV Sennestadt","","","","","","","BV Sennestadt e. V."]
[17986,"Sm 2","Dietger","Krost","BGC Wolfsburg","Ja","","","","","","1. Bahnen - Golf - Club Wolfsburg e. V."]
[6334,"Sm 2","Heinz","Krüchten",{"$f":"VLOOKUP(L1730,Kurznamen,2,0)","v":"BGV Rodalben"},{"$f":"IF(VLOOKUP(L1730,Kurznamen,3,0)=\"Ja\",\"Ja\",\"\")","v":""},"","","","","","1. Bahnengolfverein Rodalben 1977 e. V."]
[66558,"Sm 2","Bernhard","Krug","BGC Landshut","","","","","","","1. Bahnengolf-Club Landshut e. V."]
[17741,"Sm 2","Reinhard","Krüger","MSC Neu-Wulstorf","","","","","","","1. Minigolf-Sport-Club Hamburg-Neu-Wulmstorf e. V."]
[958,"H","Michael","Krull","MGC Göttingen","Ja","","","","","","1. Miniatur-Golfsport-Club 1970 Göttingen e. V."]
[66657,"Sm 2","Karl-Heinz","Krull","MGC Göttingen","Ja","","","","","","1. Miniatur-Golfsport-Club 1970 Göttingen e. V."]
[42429,"Sw 1","Patricia","Krumay","TSV Pfungstadt","","","","","","","TSV Pfungstadt e. V. Abteilung Bahnengolf"]
[36856,"Sm 1","Kai","Krumm","HMC Büttgen","","","","","","","Hobbysport Miniaturgolfclub Büttgen e. V."]
[65839,"Sw 1","Melanie","Krumm","HMC Büttgen","","","","","","","Hobbysport Miniaturgolfclub Büttgen e. V."]
[67467,"D","Stefanie","Krüper","MGC Bad Oldesloe","","","","","","","Miniaturgolfclub Bad Oldesloe von 1964 e. V."]
[67466,"Jm","Finn Åke","Krüper","MGC Bad Oldesloe","","","","","","","Miniaturgolfclub Bad Oldesloe von 1964 e. V."]
[47258,"Sm 1","André","Kruse","MGC Bad Salzuflen","","","","","","","Minigolf-Club Bad Salzuflen e. V."]
[67169,"Sm 1","Klaus-Bernd","Kruse","MGC Viernheim","","","","","","","MGC Millennium Viernheim e. V."]
[40300,"Sm 2","Manfred","Krusenbaum","VfM Bottrop","","","","","","","Verein für Minigolf Bottrop e. V."]
[67017,"H","Maurice","Krzyza","BGC Bochum","","","","","","","Bahnengolf-Sportclub Bochum 1978 e. V."]
[35655,"H","Sebastian","Kube","MGC Dormagen-Brechten","","","","","","","Minigolfclub Dormagen - Brechten e. V."]
[65952,"H","Kai","Kübler","MGC Monrepos","","","","","","","Minigolfclub Monrepos e. V."]
[66045,"Sm 2","Manfred","Kubzda","MGV Bremen","Ja","","","","","","Miniatur-Golf-Verein Bremen e. V."]
[66836,"Sw 2","Elke","Kubzda","MGV Bremen","Ja","","","","","","Miniatur-Golf-Verein Bremen e. V."]
[42798,"Sm 2","Dieter","Kuck","BGV Backumer Tal","","","","","","","BGV Backumer Tal Herten e. V."]
[37693,"Sm 2","Helmut","Kühbauch","MGC Metzingen","","","","","","","1. Miniaturgolf Club Metzingen e. V."]
[17549,"Sm 2","Dieter","Kuhl","MGU Neviges","","","","","","","Minigolfunion Neviges-Odenthal 1968 e. V."]
[62879,"Sw 2","Magdalena","Kuhl","MGU Neviges","","","","","","","Minigolfunion Neviges-Odenthal 1968 e. V."]
[29326,"Sm 1","Peter","Kuhlenberg","SSC Halver","","","","","","","SSC Halver e. V."]
[66350,"H","Giuseppe","Kühmstädt","BGSV Castrop","","","","","","","Bahnengolfsportverein Castrop e. V. 1961"]
[65929,"H","Dustin","Kuhn","VfM Berlin","","","","","","","Verein für Minigolf e. V. Berlin"]
[44146,"Sm 2","André","Kuhn","MGC Göttingen","Ja","","","","","","1. Miniatur-Golfsport-Club 1970 Göttingen e. V."]
[67557,"Sm 2","Rolf","Kuhn","MC Schriesheim","","","","","","","Miniaturgolf Sportclub Schriesheim e. V."]
[66860,"Sm 1","Marco","Kühn","MGC Wanne-Eickel","","","","","","","Minigolfclub Rot-Weiß Wanne-Eickel e. V."]
[40132,"Sm 2","Ingo","Kuhnert","MGC Wertheim","","","","","","","Minigolfdub Wertheim ´91 e. V."]
[45671,"H","Stefan","Küll","MGC Bad Salzuflen","","","","","","","Minigolf-Club Bad Salzuflen e. V."]
[40126,"H","Christian","Kullick","Tempelhofer MV","","","","","","","Tempelhofer Miniaturgolf Verein von 1965 e. V."]
[20595,"Sm 2","Robert","Kullick","Tempelhofer MV","","","","","","","Tempelhofer Miniaturgolf Verein von 1965 e. V."]
[66042,"Sm 1","Ingo","Kullmann","MSV Bad Kreuznach","","","","","","","MSV Bad Kreuznach e. V."]
[44774,"Sm 2","Peter","Kulse","MGC Olympia Kiel","","","","","","","Miniaturgolfclub Olympia Kiel e. V."]
[21411,"Sm 2","Wolfgang","Kunert","MGC Bamberg","","","","","","","1. Minigolfclub Bamberg e. V."]
[38351,"Sm 2","Herbert","Kunimünch","BSV Inzlingen","","","","","","","Bahnengolf-Sportverein Inzlingen 1979 e. V."]
[38352,"Sw 2","Monika","Kunimünch","BSV Inzlingen","","","","","","","Bahnengolf-Sportverein Inzlingen 1979 e. V."]
[67316,"D","Jennifer","Kunisch","MGC Monrepos","","","","","","","Minigolfclub Monrepos e. V."]
[30336,"Sm 1","Jens-Michael","Künnecke","BGC Northeim","Ja","","","","","","Bahnen-Golf-Club Northeim e. V."]
[33425,"H","Marcel","Kunstmann","Elbhavelland","","","","","","","Elbhavelland e. V. Abteilung Minigolfsport"]
[33427,"Sm 1","Andreas","Kunstmann","Elbhavelland","","","","","","","Elbhavelland e. V. Abteilung Minigolfsport"]
[30521,"Sm 1","Markus","Kuntermann","CGC Hamm","","","","","","","Cobigolf-Verein Hamm 2019 e. V."]
[66139,"D","Lisa","Kuntze","TSV Pfungstadt","","","","","","","TSV Pfungstadt e. V. Abteilung Bahnengolf"]
[66428,"Sm 2","Jürgen","Kuntze","TSV Pfungstadt","","","","","","","TSV Pfungstadt e. V. Abteilung Bahnengolf"]
[66519,"Sm 1","Peter","Kunz","MGC Kassel","Ja","","","","","","1. Mini-Golfsport-Club Kassel-Vellmar 1964 e. V."]
[66977,"Sw 1","Simone","Kunz","MGC Kassel","Ja","","","","","","1. Mini-Golfsport-Club Kassel-Vellmar 1964 e. V."]
[5225,"Sm 2","Bernd","Kunz","MGC Olympia Kiel","","","","","","","Miniaturgolfclub Olympia Kiel e. V."]
[25024,"Sw 2","Helga","Kunz","MGC Olympia Kiel","","","","","","","Miniaturgolfclub Olympia Kiel e. V."]
[6538,"Sm 2","Hans-Peter","Künzel","MGC Ludwigshafen","","","","","","","1. Miniatur-Golf-Club Ludwigshafen 1964 e. V."]
[66855,"H","Thorsten","Kurkowski","MC Gelsenkirchen","","","","","","","1. Minigolf Club Gelsenkirchen e. V."]
[37998,"H","Patrick","Kurtz","Bochumer MC","","","","","","","Bochumer Minigolf-Club 1960 e. V."]
[38084,"Sm 2","Rainer","Kurtz","BGC Bochum","","","","","","","Bahnengolf-Sportclub Bochum 1978 e. V."]
[34665,"H","Jochen","Kurz","MGC Metzingen","","","","","","","1. Miniaturgolf Club Metzingen e. V."]
[41007,"H","Mikael","Kurzweg","Bochumer MC","","","","","","","Bochumer Minigolf-Club 1960 e. V."]
[66103,"H","Raphael","Kuschel","MGC Dormagen-Brechten","","","","","","","Minigolfclub Dormagen - Brechten e. V."]
[23321,"Sm 2","Jürgen","Kuß","MGC Mannheim","","","","","","","1. Miniatur-Golf-Club Mannheim 1968 e. V."]
[46027,"Sm 2","Bernd","Kussnereit","MGC Homburger Land","","","","","","","MGC Homburger Land e. V."]
[5956,"Sm 2","Helmut","Kuttig","MGU Neviges","","","","","","","Minigolfunion Neviges-Odenthal 1968 e. V."]
[25372,"Sm 2","Emil","Laber","BIG Asperg","","","","","","","Bahnengolf-Interessen-Gemeinschaft Asperg e. V. 1982"]
[25371,"Sw 2","Andrea","Laber","BIG Asperg","","","","","","","Bahnengolf-Interessen-Gemeinschaft Asperg e. V. 1982"]
[67419,"Sm 1","Peter","Labude","VfL Lohbrügge","","","","","","","Verein für Leibesübungen Lohbrügge von 1892 e. V. Abteilung Bahnengolf"]
[29677,"H","René","Lagerquist","MGC Olympia Kiel","","","","","","","Miniaturgolfclub Olympia Kiel e. V."]
[49742,"Sw 1","Britta","Lagerquist","MGC Olympia Kiel","","","","","","","Miniaturgolfclub Olympia Kiel e. V."]
[41848,"Sm 1","Stefan","Lahann","MSC Neu-Wulstorf","","","","","","","1. Minigolf-Sport-Club Hamburg-Neu-Wulmstorf e. V."]
[5260,"Sm 2","Peter","Lais",{"$f":"VLOOKUP(L1794,Kurznamen,2,0)","v":"Münchener MC"},{"$f":"IF(VLOOKUP(L1794,Kurznamen,3,0)=\"Ja\",\"Ja\",\"\")","v":""},"","","","","","1. Münchener Minigolf-Club 1962 e. V."]
[65072,"Sw 2","Cornelia","Lais","Münchener MC","","","","","","","1. Münchener Minigolf-Club 1962 e. V."]
[37708,"H","Kevin","Lammers","VfM Bottrop","","","","","","","Verein für Minigolf Bottrop e. V."]
[29247,"Sm 1","Andreas","Lammers","VfM Bottrop","","","","","","","Verein für Minigolf Bottrop e. V."]
[6879,"Sm 2","Helmut","Landl","BSV München","","","","","","","Bahnengolfsportverein 86 München e. V."]
[31613,"Sw 2","Christa","Landl","BSV München","","","","","","","Bahnengolfsportverein 86 München e. V."]
[35806,"Sm 1","Martin","Lanfer","MGC Dormagen-Brechten","","","","","","","Minigolfclub Dormagen - Brechten e. V."]
[34780,"Sm 1","Jürgen","Lang","MGC Süßen","","","","","","","1. Miniaturgolfclub Süßen e. V."]
[46037,"Sm 1","Ewald","Lang","MSC Bad Godesberg","","","","","","","Minigolf-Sport-Club Bad Godesberg e. V."]
[37857,"Sm 2","Michael","Lang","BGC Bildstock","","","","","","","Bahnen-Golf-Club Bildstock e. V."]
[879,"H","Kevin","Lange","BGC Diepholz","Ja","","","","","","Bahnen-Golf-Club Diepholz e. V."]
[37204,"H","Philipp","Lange","BGV Backumer Tal","","","","","","","BGV Backumer Tal Herten e. V."]
[67718,"H","Justin","Lange","TSV Arendsee","","","","","","","Turn- und Sportverein Arendsee e. V. Abteilung Minigolf"]
[12503,"Sm 2","Dieter","Lange","MGC Witten","","","","","","","Minigolfclub \"AS\" Witten 1963 e. V."]
[17614,"Sm 2","Friedrich","Lange","KGC Mönchengladbach","","","","","","","1. Klein-Golf-Club Mönchengladbach e. V."]
[17112,"Sw 2","Maria","Lange","MGC Witten","","","","","","","Minigolfclub \"AS\" Witten 1963 e. V."]
[17615,"Sw 2","Marlene","Lange","KGC Mönchengladbach","","","","","","","1. Klein-Golf-Club Mönchengladbach e. V."]
[33485,"D","Bianca","Langenbacher","MGC Tuttlingen","","","","","","","Erster Minigolf - Club Tuttlingen e. V."]
[66570,"H","Yannick","Langer","MGC Ingolstadt","","","","","",""," Miniaturgolf-Club Ingolstadt e. V."]
[29043,"Sm 2","Waldemar","Langer","BGC Landshut","","","","","","","1. Bahnengolf-Club Landshut e. V."]
[66571,"Sm 2","Viktor","Langer","MGC Ingolstadt","","","","","",""," Miniaturgolf-Club Ingolstadt e. V."]
[35700,"Sm 2","Martin","Langfeld","MGC Metzingen","","","","","","","1. Miniaturgolf Club Metzingen e. V."]
[34921,"Sm 2","Heinz","Langner","TSV Flöha","","","","","","","Turn- und Sportverein Flöha 1848 e. V. Abteilung Minigolf"]
[902,"D","Janina","Laskowski","BGC Hannover","Ja","","","","","","1. Bahnen-Golf-Club Hannover e. V."]
[44812,"Sm 2","Günter","Lassen","MSC Herscheid","","","","","","","Minigolf-Sportclub Herscheid 1963 e. V."]
[50101,"D","Tanja","Lauber-Selka","MSK Neheim-Hüsten","","","","","","","MINIGOLF-SPORT-KLUB Neheim-Hüsten e. V."]
[41392,"Sm 1","Holger","Lauble","MGF Waldshut","","","","","","","Minigolffreunde Waldshut 1974 e. V."]
[6368,"Sm 2","Ekkehard","Lauer","OMGC Imgolstadt","","","","","","","Oberbayerische Minigolf-Club Ingolstadt e. V."]
[67833,"Sm 2","Ludwig","Laufenberg","BGS Hardenberg","","","","","","","BGS Hardenberg-Pötter e. V."]
[67322,"Sm 1","Gunter","Laurenz","Osnabrücker MC","","","","","","","Osnabrücker Minigolf Club von 1963 e. V."]
[67321,"Sw 1","Anja","Laurenz","Osnabrücker MC","","","","","","","Osnabrücker Minigolf Club von 1963 e. V."]
[66198,"Sm 2","Horst","Laurenz","MSG Kempten","","","","","","","Minigolf-Sport-Gemeinschaft Kempten e. V."]
[34469,"D","Aylin","Lauterfeld","TSV Pfungstadt","","","","","","","TSV Pfungstadt e. V. Abteilung Bahnengolf"]
[35659,"H","Marcel","Laux","MGC Traben-Trarbach","","","","","","","Minigolfclub Traben-Trarbach e. V."]
[33131,"Sm 1","Alexander","Laux","MGC Traben-Trarbach","","","","","","","Minigolfclub Traben-Trarbach e. V."]
[67537,"Jm","Heinrich","Lay","MSC Bensheim-Auerbach","","","","","","","Minigolf-Sport-Club Bensheim-Auerbach e. V."]
[47498,"Sw 1","Ilona","Lechler","MGC Schwaikheim","","","","","","","Miniaturgolf – Club Schwaikheim e. V."]
[67187,"Jm","Justin","Lechtenfeld","MGC Wanne-Eickel","","","","","","","Minigolfclub Rot-Weiß Wanne-Eickel e. V."]
[48696,"Sm 2","Valentino","Legisa","BGSC Gladbeck","","","","","","","Bahnengolfsportclub \"Gut Schlag\" Gladbeck e. V."]
[67372,"H","Niclas","Lehmann","SC Dortmund","","","","","","","Sport-Club Olympia Dortmund e. V. "]
[67753,"Jw","Fabienne","Lehmann","BGC Dormagen","","","","","","","Bahnengolf-Club Dormagen e. V."]
[67754,"Sw 1","Michaela","Lehmann","BGC Dormagen","","","","","","","Bahnengolf-Club Dormagen e. V."]
[23055,"Sm 2","Detlef","Lehmann","Bochumer MC","","","","","","","Bochumer Minigolf-Club 1960 e. V."]
[66356,"Sm 2","Reiner","Lehmann","MGC Bad Bocklet","","","","","","","Miniatur-Golf-Club \"Stahlquelle\", Bad Bocklet 1989 e. V."]
[67640,"Sm 1","Nico","Lehn","BGC Diepholz","Ja","","","","","","Bahnen-Golf-Club Diepholz e. V."]
[32627,"H","Kevin","Leickel","MGC Olympia Kiel","","","","","","","Miniaturgolfclub Olympia Kiel e. V."]
[35756,"Sm 2","Andreas","Leidlein","MC Gelsenkirchen","","","","","","","1. Minigolf Club Gelsenkirchen e. V."]
[66327,"Sm 2","Adam","Leist","RKV Rheinstetten","","","","","","","Rad- und Kraftfahrervereins \"Solidarität\" Mörsch e. V. Abteilung Minigolf Wölfe Rheinstetten 02"]
[41235,"Sm 1","Hans","Lemanczyk","MSC Neu-Wulstorf","","","","","","","1. Minigolf-Sport-Club Hamburg-Neu-Wulmstorf e. V."]
[62202,"Sm 2","Dieter","Lemanczyk","MSC Neu-Wulstorf","","","","","","","1. Minigolf-Sport-Club Hamburg-Neu-Wulmstorf e. V."]
[29671,"H","André","Lemke","MGC Olympia Kiel","","","","","","","Miniaturgolfclub Olympia Kiel e. V."]
[34585,"D","Sabrina","Lemke","MGC Olympia Kiel","","","","","","","Miniaturgolfclub Olympia Kiel e. V."]
[28673,"Sm 1","Kai","Lemke","MGC Olympia Kiel","","","","","","","Miniaturgolfclub Olympia Kiel e. V."]
[67207,"Sm 1","Thomas","Lemke","Kölner MC","","","","","","","Kölner Miniatur Golf Club e. V."]
[41266,"Sw 1","Cornelia","Lemke","MGC Olympia Kiel","","","","","","","Miniaturgolfclub Olympia Kiel e. V."]
[44385,"Sm 1","Andreas","Lemm","MGC Biebertal","","","","","","","Miniatur-Golf-Club Freizeitzentrum Biebertal e. V."]
[67390,"Sm 2","Georg","Lemm","Kölner MC","","","","","","","Kölner Miniatur Golf Club e. V."]
[67582,"Sw 2","Marita","Lemm","Kölner MC","","","","","","","Kölner Miniatur Golf Club e. V."]
[66067,"Sw 2","Ute","Lendner","VfL Lohbrügge","","","","","","","Verein für Leibesübungen Lohbrügge von 1892 e. V. Abteilung Bahnengolf"]
[67220,"Sm 2","Georg","Lendzian","SC Dortmund","","","","","","","Sport-Club Olympia Dortmund e. V. "]
[29795,"D","Katharina","Lenertz","MSC Wesel","","","","","","","1. Minigolf-Sportclub Wesel 66 66 e. V. "]
[67816,"H","Sebastian","Lengeling","MGC Paderborn","","","","","","","1. Minigolf-Club Paderborn 1980 e. V."]
[38613,"Sm 1","Andre","Lenger","MGC Bad Salzuflen","","","","","","","Minigolf-Club Bad Salzuflen e. V."]
[61716,"Sm 2","Rolf","Lenk","MGC Witten","","","","","","","Minigolfclub \"AS\" Witten 1963 e. V."]
[26539,"Sm 1","Axel","Lenz",{"$f":"VLOOKUP(L1858,Kurznamen,2,0)","v":"MGF Hilzingen"},{"$f":"IF(VLOOKUP(L1858,Kurznamen,3,0)=\"Ja\",\"Ja\",\"\")","v":""},"","","","","","Minigolffreunde Hilzingen 80 e. V."]
[38115,"Sm 2","Jürgen","Lenz","HMC Büttgen","","","","","","","Hobbysport Miniaturgolfclub Büttgen e. V."]
[67315,"Sm 2","Heinz Peter","Leonhardt","MGC Bad Homburg","","","","","","","Minigolf-Club Bad Homburg e. V."]
[36564,"H","Björn","Lepa","TSV Salzgitter","Ja","","","","","","Turn- und Sportverein Salzgitter e. V. Abteilung Bahnengolf"]
[35504,"H","Gerrit","Lerch","MC Ilvesheim","","","","","","","Miniaturgolf-Club Ilvesheim e. V."]
[67652,"Schw","Leandra","Leske","Tempelhofer MV","","","","","","","Tempelhofer Miniaturgolf Verein von 1965 e. V."]
[66401,"Sm 1","Jörg","Leske","Tempelhofer MV","","","","","","","Tempelhofer Miniaturgolf Verein von 1965 e. V."]
[5776,"Sw 2","Irena","Lesnik","SSV Ulm","","","","","","","Schwimm- und Sportverein Ulm 1846 e. V. Abteilung Bahnengolf"]
[40048,"Sm 1","Michael","Leßner","Bochumer MC","","","","","","","Bochumer Minigolf-Club 1960 e. V."]
[30039,"Sm 2","Reinhard","Letzel","BGC Rheinau-Freistett","","","","","","","BGC Rheinau-Freistett e. V."]
[3756,"Sm 2","Hans-Winfried","Leuchtenberger","VfM Berlin","","","","","","","Verein für Minigolf e. V. Berlin"]
[51324,"H","Marcus","Leuthäußer","MGV Bremen","Ja",21737,"","","","X","Miniatur-Golf-Verein Bremen e. V."]
[36908,"H","Philipp","Lewin","MSK Neheim-Hüsten","","","","","","","MINIGOLF-SPORT-KLUB Neheim-Hüsten e. V."]
[38260,"D","Annika","Lewin","MSK Neheim-Hüsten","","","","","","","MINIGOLF-SPORT-KLUB Neheim-Hüsten e. V."]
[66907,"Sw 2","Karin","Leyer","SV Dreieichenhain","","","","","","","Sportverein 1890 e. V. Dreieichenhain Abteilung Bahnengolf"]
[66351,"Sw 1","Heike","Liberoudis","VfB Osnabrück","",28396,"X","","","","Verein für Bahnengolf Osnabrück von 1984 e. V."]
[37633,"H","Jan Peter","Lichtenberg","KC Homburg","","","","","","","1. Kleingolf Club Homburg-Saar 1967 e. V."]
[23239,"Sm 2","Kurt","Lichtenberg","KC Homburg","","","","","","","1. Kleingolf Club Homburg-Saar 1967 e. V."]
[65975,"Sm 2","Hans-Jürgen","Lichterfeld","MGC Bergisch Gladbach","","","","","","","Minigolf-Club Bergisch Gladbach Gierath e. V."]
[65873,"H","Johannes","Lieber","KC Homburg","","","","","","","1. Kleingolf Club Homburg-Saar 1967 e. V."]
[23980,"Sm 2","Bernhard","Liebetrau","MC Schriesheim","","","","","","","Miniaturgolf Sportclub Schriesheim e. V."]
[48671,"Sm 1","Sven","Liebig","BGC Bad Nenndorf","Ja","","","","","","Bahnen-Golf-Club Bad Nenndorf e. V."]
[42408,"Sm 2","Manfred","Liebstückel","MGC Wertheim","","","","","","","Minigolfdub Wertheim ´91 e. V."]
[42417,"Sw 2","Ruth","Liebstückel","MGC Wertheim","","","","","","","Minigolfdub Wertheim ´91 e. V."]
[27921,"Sm 2","Peter","Liedhegener","MSK Neheim-Hüsten","","","","","","","MINIGOLF-SPORT-KLUB Neheim-Hüsten e. V."]
[66148,"D","Simone","Limpius","TG Höchberg","","","","","","","Turngemeinde Höchberg von 1862 Bahnengolf e. V."]
[44172,"Sm 1","Matthias","Limpius","TG Höchberg","","","","","","","Turngemeinde Höchberg von 1862 Bahnengolf e. V."]
[42074,"Sw 1","Andrea","Limpius","TG Höchberg","","","","","","","Turngemeinde Höchberg von 1862 Bahnengolf e. V."]
[5966,"Sm 2","Werner","Limpius","TG Höchberg","","","","","","","Turngemeinde Höchberg von 1862 Bahnengolf e. V."]
[36091,"Sm 2","Alfred","Lindauer","OMGC Imgolstadt","","","","","","","Oberbayerische Minigolf-Club Ingolstadt e. V."]
[25107,"Sm 2","Jürgen","Linde","SSC Attendorn","","","","","","","Sterngolf-Sport-Club Attendorn e. V."]
[66253,"H","Lukas","Lindemann","BSV Bad Homburg","","","","","","","Bahnengolf-Sportverein Bad Homburg v.d.H. e. V."]
[66254,"Sm 1","Oliver","Lindemann","BSV Bad Homburg","","","","","","","Bahnengolf-Sportverein Bad Homburg v.d.H. e. V."]
[40203,"D","Mareike","Lindenberg","BGC Celle","Ja","","","","","","1. Bahnen-Golf-Club Celle von 1964 e. V."]
[133,"Sm 2","Andreas","Lindenblatt","VfB Osnabrück","","","","","","","Verein für Bahnengolf Osnabrück von 1984 e. V."]
[40475,"Sm 1","Bernhard","Lindner","NMC Kelheim","","","","","","","1. Niederbayerischer Minigolf-Club Kelheim e. V."]
[9959,"Sm 2","Fritz","Lindner","ASV Pegnitz","","","","","","","Allgemeiner Sportverein Pegnitz e. V. Abteilung Minigolf"]
[41825,"Sm 2","Gisbert","Lindner","BGC Neutraubling","","","","","","","Bahnengolf-Club Neutraubling e. V."]
[37135,"D","Jacqueline","Lingemann","VfB Osnabrück","","","","","","","Verein für Bahnengolf Osnabrück von 1984 e. V."]
[37136,"D","Sarah","Lingemann","VfB Osnabrück","","","","","","","Verein für Bahnengolf Osnabrück von 1984 e. V."]
[66396,"Jw","Christin","Lingemann","Osnabrücker MC","",28459,"X","","","","Osnabrücker Minigolf Club von 1963 e. V."]
[48947,"Sm 2","Konrad","Lingemann","Osnabrücker MC","",20853,"","X","","X","Osnabrücker Minigolf Club von 1963 e. V."]
[37973,"Sm 2","Horst","Linke","BGC Singen","","","","","","","1. Bahnengolf-Club Singen e. V."]
[37415,"D","Christina","Linke-König","BGC Singen","","","","","","","1. Bahnengolf-Club Singen e. V."]
[66747,"Jm","Matti","Linker","CGC Rauschenberg","","","","","","","Cobigolf-Club Rauschenberg e. V."]
[67817,"H","Robin","Linnemann","MGC Paderborn","","","","","","","1. Minigolf-Club Paderborn 1980 e. V."]
[67648,"H","Tiemo","Lipphausen","MGC Paderborn","","","","","","","1. Minigolf-Club Paderborn 1980 e. V."]
[65442,"D","Brigitte","Lischke","OMGC Imgolstadt","","","","","","","Oberbayerische Minigolf-Club Ingolstadt e. V."]
[33730,"Sm 1","Martin","Lischke","OMGC Imgolstadt","","","","","","","Oberbayerische Minigolf-Club Ingolstadt e. V."]
[29299,"Sm 2","Heinz","Löbel","OMGC Imgolstadt","","","","","","","Oberbayerische Minigolf-Club Ingolstadt e. V."]
[36844,"Sm 2","Gerhard","Lödige","VfB Osnabrück","","","","","","","Verein für Bahnengolf Osnabrück von 1984 e. V."]
[36853,"Sw 2","Maria","Lödige","VfB Osnabrück","","","","","","","Verein für Bahnengolf Osnabrück von 1984 e. V."]
[6464,"Sm 2","Manfred","Loewe","BSC Ennepetal","","","","","","","Bahngolf-Sport-Club Ennepetal e. V."]
[66736,"Sm 2","Harry","Löffler","BGC Landshut","","","","","","","1. Bahnengolf-Club Landshut e. V."]
[30914,"Sm 2","Alfred","Lohe","BGSC Gladbeck","","","","","","","Bahnengolfsportclub \"Gut Schlag\" Gladbeck e. V."]
[36543,"Sw 2","Angelika","Lohe","BGSC Gladbeck","","","","","","","Bahnengolfsportclub \"Gut Schlag\" Gladbeck e. V."]
[36001,"H","Christian","Lohmann","CGC Hamm","","","","","","","Cobigolf-Verein Hamm 2019 e. V."]
[47063,"Sm 1","Thomas","Lohöfener","BV Sennestadt","","","","","","","BV Sennestadt e. V."]
[45633,"Sm 2","Michael","Löhr","BGC Bochum","","","","","","","Bahnengolf-Sportclub Bochum 1978 e. V."]
[49463,"Sw 2","Elke","Löhr","BGC Bochum","","","","","","","Bahnengolf-Sportclub Bochum 1978 e. V."]
[4788,"Sm 2","Roland","Löhrlein","FMGC Lichtenfels","","","","","","","1. Fränkischer Minigolfclub Lichtenfels 1961 e. V."]
[66834,"Sm 1","Martin","Loibl","Berliner MSC","","","","","","","1. Berliner Miniaturgolf-Sportclub e. V. 1960"]
[33631,"H","Thomas","Lojewski","MGC Murnau","","","","","","","Minigolfclub Murnau am Staffelsee e. V."]
[67775,"Sm 2","Ulrich","Loll","MGC Köln","","","","","","","1. Minigolf-Club Köln 1961 e. V."]
[66958,"Sm 2","Peter","Lorch",{"$f":"VLOOKUP(L1922,Kurznamen,2,0)","v":"MGC Mainz"},{"$f":"IF(VLOOKUP(L1922,Kurznamen,3,0)=\"Ja\",\"Ja\",\"\")","v":""},"","","","","","Erster Mainzer Minigolf-Club e. V. 1964"]
[35306,"H","Patrick","Lorenz","SG Arheilgen","","","","","","","Sportgemeinschaft Arheilgen 1876/1945 e. V. Abteilung Bahnengolf"]
[33338,"Sm 2","Uwe","Lorenz","MC Möve Cuxhaven","Ja","","","","","","Miniaturgolf-Club \"Möve\" Cuxhaven-Sahlenburg e. V."]
[46048,"Sw 1","Melanie","Lorgie","MGC Olympia Kiel","","","","","","","Miniaturgolfclub Olympia Kiel e. V."]
[5852,"Sm 2","Hans-Herbert","Lorgie","MGC Olympia Kiel","","","","","","","Miniaturgolfclub Olympia Kiel e. V."]
[41253,"Sw 2","Regina","Lorgie","MGC Olympia Kiel","","","","","","","Miniaturgolfclub Olympia Kiel e. V."]
[27300,"Sm 1","Thomas","Losch","BGC Hannover","Ja","","","","","","1. Bahnen-Golf-Club Hannover e. V."]
[36171,"H","Dennis","Löschmann","Tempelhofer MV","","","","","","","Tempelhofer Miniaturgolf Verein von 1965 e. V."]
[34157,"Sm 2","Michael","Lotz","MGC Bad Soden","","","","","","","Miniaturgolfclub Bad Soden-Salmünster e. V."]
[67632,"Sw 2","Gudrun","Lotz","MGC Bad Homburg","","","","","","","Minigolf-Club Bad Homburg e. V."]
[66395,"Sm 2","Hans","Louven","VfB Osnabrück","","","","","","","Verein für Bahnengolf Osnabrück von 1984 e. V."]
[67656,"Sm 1","Jochen","Löwer","MGC Ludwigshafen","","","","","","","1. Miniatur-Golf-Club Ludwigshafen 1964 e. V."]
[5594,"Sm 2","Herbert","Löwer","MGC Kassel","Ja","","","","","","1. Mini-Golfsport-Club Kassel-Vellmar 1964 e. V."]
[67741,"Sw 1","Sylvia","Lück","BV Sennestadt","","","","","","","BV Sennestadt e. V."]
[45994,"Sw 1","Bettina","Luckei","MGC Lohfelden","Ja","","","","","","1. Miniatur-Golfsport-Club Lohfelden e. V."]
[45995,"Sm 2","Manfred","Luckei","MGC Lohfelden","Ja","","","","","","1. Miniatur-Golfsport-Club Lohfelden e. V."]
[37293,"H","Dominik","Ludwig","BGC Goslar","Ja","","","","","","Bahnen-Golf-Club Goslar e. V."]
[37295,"H","Sven","Ludwig","BGC Goslar","Ja","","","","","","Bahnen-Golf-Club Goslar e. V."]
[1501,"Sw 1","Kornelia","Ludwig","BGC Goslar","Ja","","","","","","Bahnen-Golf-Club Goslar e. V."]
[67807,"Sm 2","Michael","Ludwig","BGSC Gladbeck","","","","","","","Bahnengolfsportclub \"Gut Schlag\" Gladbeck e. V."]
[67808,"Sw 2","Adelheid","Ludwig","BGSC Gladbeck","","","","","","","Bahnengolfsportclub \"Gut Schlag\" Gladbeck e. V."]
[67373,"H","Niklas","Ludzay","SC Dortmund","","","","","","","Sport-Club Olympia Dortmund e. V. "]
[41227,"Sm 2","Robert","Lugauer","MGC Ingolstadt","","","","","",""," Miniaturgolf-Club Ingolstadt e. V."]
[3261,"Sm 2","Werner","Lührs","BGC Celle","Ja","","","","","","1. Bahnen-Golf-Club Celle von 1964 e. V."]
[33613,"H","Marcel","Lukat","MGC Brunsbüttel","","","","","","","Miniaturgolf-Club Brunsbüttel e. V."]
[67434,"Sm 2","Wigbert","Lüke","BV Sennestadt","","","","","","","BV Sennestadt e. V."]
[40720,"Sm 1","Dirk","Lumma","HMC Büttgen","","","","","","","Hobbysport Miniaturgolfclub Büttgen e. V."]
[38641,"Sm 2","Herbert","Luttmann","VfB Osnabrück","","","","","","","Verein für Bahnengolf Osnabrück von 1984 e. V."]
[22917,"Sm 1","Hugo","Lutz","BGC Singen","","","","","","","1. Bahnengolf-Club Singen e. V."]
[40232,"Sm 2","Helmut","Lutz","SSC Attendorn","","","","","","","Sterngolf-Sport-Club Attendorn e. V."]
[22913,"Sw 2","Martina","Lutz","BGC Singen","","","","","","","1. Bahnengolf-Club Singen e. V."]
[45123,"Sw 2","Angelika","Luz","MGC Metzingen","","","","","","","1. Miniaturgolf Club Metzingen e. V."]
[34902,"H","Daniel","Maar","BGSV Castrop","","","","","","","Bahnengolfsportverein Castrop e. V. 1961"]
[66036,"D","Vanessa","Maaß","MGC Brunsbüttel","","","","","","","Miniaturgolf-Club Brunsbüttel e. V."]
[43835,"Sw 1","Bettina","Maaß","MGC Brunsbüttel","","","","","","","Miniaturgolf-Club Brunsbüttel e. V."]
[43837,"Sm 2","Herbert","Maaß","MGC Brunsbüttel","","","","","","","Miniaturgolf-Club Brunsbüttel e. V."]
[67706,"H","Benjamin","Maczkiewicz","BGV Backumer Tal","","","","","","","BGV Backumer Tal Herten e. V."]
[67167,"Sm 1","Stefan","Maes","BGS Hardenberg","","","","","","","BGS Hardenberg-Pötter e. V."]
[38127,"Sm 2","Friedel","Maesel","MC Lüdenscheid","","","","","","","MC 62 Lüdenscheid e. V."]
[30185,"Sm 1","Thomas","Magin","MGC Ludwigshafen","","","","","","","1. Miniatur-Golf-Club Ludwigshafen 1964 e. V."]
[67428,"Sw 2","Regina","Magin","MGC Bad Homburg","","","","","","","Minigolf-Club Bad Homburg e. V."]
[67278,"H","Simon","Mahl","BGC Garmisch","","","","","","","1. Bahnengolfclub Garmisch-Partenkirchen e. V."]
[49672,"Sm 2","Josef","Mahl","BGC Garmisch","","","","","","","1. Bahnengolfclub Garmisch-Partenkirchen e. V."]
[36823,"Sm 1","Niklas","Maier","MGC Unterschneidheim","","","","","","","Minigolfclub Unterschneidheim e. V."]
[38562,"Sw 1","Marianne","Maier","MGC Unterschneidheim","","","","","","","Minigolfclub Unterschneidheim e. V."]
[47032,"Sm 2","Josef","Maier","MGC Wolnzach","","","","","","","Miniaturgolf-Club Wolnzach e. V."]
[66497,"H","Anton","Maierhofer","MGC Bad Feilnbach","","","","","","","Minigolfclub Bad Feilnbach e. V."]
[67044,"H","Thomas","Maisch","MGC Monrepos","","","","","","","Minigolfclub Monrepos e. V."]
[67043,"D","Ramona","Maisch","MGC Monrepos","","","","","","","Minigolfclub Monrepos e. V."]
[67465,"H","Nurfet","Majdanac","BGC Ottobrunn","","","","","","","BGC 90 Ottobrunn e. V."]
[37360,"Sm 1","Frank","Maldei","BGSC Gladbeck","","","","","","","Bahnengolfsportclub \"Gut Schlag\" Gladbeck e. V."]
[49850,"Sm 1","Ralf","Malirs","SV Lurup","","","","","","","Sportverein Lurup-Hamburg von 1923 e. V. Abteilung Bahnengolf"]
[67730,"H","Brain ","Mally","SV Dreieichenhain","","","","","","","Sportverein 1890 e. V. Dreieichenhain Abteilung Bahnengolf"]
[37865,"Sm 1","Joachim","Mally","SV Dreieichenhain","","","","","","","Sportverein 1890 e. V. Dreieichenhain Abteilung Bahnengolf"]
[25785,"Sm 2","Norman","Mandel","HMC Büttgen","","","","","","","Hobbysport Miniaturgolfclub Büttgen e. V."]
[50926,"Sm 1","Frank","Manderscheid","MGC Ludwigshafen","","","","","","","1. Miniatur-Golf-Club Ludwigshafen 1964 e. V."]
[6693,"Sm 2","Hans","Manderscheid","FZC Bliesen","","","","","","","Freizeit Club Bliesen e. V."]
[3796,"Sm 2","Hans-Joachim","Mann","MGC Murnau","","","","","","","Minigolfclub Murnau am Staffelsee e. V."]
[38500,"Sm 1","Stefan","Manthey","MSC Bad Godesberg","","","","","","","Minigolf-Sport-Club Bad Godesberg e. V."]
[67046,"Jm","Tim","Manz","Reinickendorfer MGC","","","","","","","Reinickendorfer Miniatur - Golfsport - Club e. V."]
[45029,"Sm 2","Wolfgang","Manz","BGC Illertissen","","","","","","","Bahnengolfclub Illertissen e. V."]
[40944,"Sw 2","Susanne","Manz","BGC Illertissen","","","","","","","Bahnengolfclub Illertissen e. V."]
[42687,"Sm 1","Christian","Marinello","MC Möve Cuxhaven","Ja","","","","","","Miniaturgolf-Club \"Möve\" Cuxhaven-Sahlenburg e. V."]
[65657,"Sm 2","Max","Märkl","BGC Neutraubling","","","","","","","Bahnengolf-Club Neutraubling e. V."]
[45267,"Sm 1","Leif","Markmann",{"$f":"VLOOKUP(L1986,Kurznamen,2,0)","v":"MGC Olympia Kiel"},{"$f":"IF(VLOOKUP(L1986,Kurznamen,3,0)=\"Ja\",\"Ja\",\"\")","v":""},"","","","","","Miniaturgolfclub Olympia Kiel e. V."]
[50930,"Sm 2","Jürgen","Marschall","FZC Bliesen","","","","","","","Freizeit Club Bliesen e. V."]
[33471,"Sm 2","Heinz","Marterer","BGC Garmisch","","","","","","","1. Bahnengolfclub Garmisch-Partenkirchen e. V."]
[42045,"Sw 1","Sabine","Marterer-Schleser","MGC München","","","","","","","1. Miniaturgolfclub München-Feldmoching e. V."]
[66957,"Sm 2","Christian","Marth","MGC Mainz","","","","","","","Erster Mainzer Minigolf-Club e. V. 1964"]
[35692,"Sw 2","Bärbel","Martin","MGC Olympia Kiel","","","","","","","Miniaturgolfclub Olympia Kiel e. V."]
[36222,"Sm 1","Sven","Martinez Moreno","MC Rheinhausen","","","","","","","1. Minigolf-Club Rheinhausen e. V."]
[47173,"Sm 1","Ingo","Marx","MSC Neu-Wulstorf","","","","","","","1. Minigolf-Sport-Club Hamburg-Neu-Wulmstorf e. V."]
[67426,"H","Marcus","Maschauer","MGC Bad Homburg","","","","","","","Minigolf-Club Bad Homburg e. V."]
[67365,"Sm 2","Claus","Maschauer","MGC Bad Homburg","","","","","","","Minigolf-Club Bad Homburg e. V."]
[67364,"Sw 2","Diana","Maschauer","MGC Bad Homburg","","","","","","","Minigolf-Club Bad Homburg e. V."]
[40718,"Sm 1","Jürgen","Maschotta","MGU Neviges","","","","","","","Minigolfunion Neviges-Odenthal 1968 e. V."]
[40721,"Sm 1","Dirk","Maschotta","MGU Neviges","","","","","","","Minigolfunion Neviges-Odenthal 1968 e. V."]
[6331,"Sm 2","Peter","Matern","MC Weinheim","","","","","","","1. Miniaturgolf-Club Weinheim e. V."]
[42640,"Sm 2","Erwin","Materne","BGC Bad Füssing","","","","","","","1. Bahnengolfclub Bad Füssing e. V."]
[37435,"H","Alexander","Mathes","MGC Bad Bocklet","","","","","","","Miniatur-Golf-Club \"Stahlquelle\", Bad Bocklet 1989 e. V."]
[66724,"Jm","Nico","Mathes","MGC Bad Bocklet","","","","","","","Miniatur-Golf-Club \"Stahlquelle\", Bad Bocklet 1989 e. V."]
[67064,"Schw","Lena","Mathes","MGC Bad Bocklet","","","","","","","Miniatur-Golf-Club \"Stahlquelle\", Bad Bocklet 1989 e. V."]
[67548,"H","David","Matthäi","KGC Bad Urach","","","","","","","Klein-Golf-Club Bad Urach e. V."]
[65804,"Sm 2","Bernd","Matthies","MGC Witten","","","","","","","Minigolfclub \"AS\" Witten 1963 e. V."]
[65803,"Sw 2","Angelika","Matthies","MGC Witten","","","","","","","Minigolfclub \"AS\" Witten 1963 e. V."]
[38370,"Sm 2","Klaus","Mattick","BGC Bremen","Ja","","","","","","Bahnen-Golf-Club Bremen e. V."]
[67549,"Schm","Julius","Mattzick","MGC Wetzlar","","","","","","","Miniatur-Golf-Club Wetzlar e. V."]
[28038,"Sm 2","Ralf","Mätz","BGC Rheinau-Freistett","","","","","","","BGC Rheinau-Freistett e. V."]
[35865,"H","Dennis","Mau","MC Rheinhausen","","","","","","","1. Minigolf-Club Rheinhausen e. V."]
[66874,"Jm","Felix","Mau","MGC Bad Homburg","","","","","","","Minigolf-Club Bad Homburg e. V."]
[66875,"Jm","Bastian","Mau","MGC Bad Homburg","","","","","","","Minigolf-Club Bad Homburg e. V."]
[48353,"Sm 1","Jürgen","Mau","MC Rheinhausen","","","","","","","1. Minigolf-Club Rheinhausen e. V."]
[38580,"H","Raik","Mauersberger","MGF Magdeburg","","","","","","","Minigolffreunde Magdeburg e. V."]
[66039,"H","Moritz","Maul","SG Arheilgen","","","","","","","Sportgemeinschaft Arheilgen 1876/1945 e. V. Abteilung Bahnengolf"]
[34481,"Sm 1","Claus","Maurer","MGC Mannheim","","","","","","","1. Miniatur-Golf-Club Mannheim 1968 e. V."]
[5100,"Sm 2","Franz","Maurer","MGC Ludwigshafen","","","","","","","1. Miniatur-Golf-Club Ludwigshafen 1964 e. V."]
[37831,"Sm 1","Christian","Mauser","TSV Arendsee","","","","","","","Turn- und Sportverein Arendsee e. V. Abteilung Minigolf"]
[66699,"Sw 2","Roswitha","Maute","MGC Hechingen","","","","","","","1. Minigolfclub Hechingen e. V."]
[1326,"D","Daniela","May","TSV Flöha","","","","","","","Turn- und Sportverein Flöha 1848 e. V. Abteilung Minigolf"]
[42368,"Sm 1","Bernd","May","MGC Ladenburg","","","","","","","1. Miniaturgolf-Club Ladenburg e. V."]
[67655,"H","Peter","Mayer","MGC Murnau","","","","","","","Minigolfclub Murnau am Staffelsee e. V."]
[66848,"Sm 1","Max","Mayer","CGC Grötzingen","","","","","","","COBI-GOLF-CLUB Blau-Gelb Grötzingen 1968 e. V."]
[45271,"Sm 1","Gerd","Mayerhofer","MGC Süßen","","","","","","","1. Miniaturgolfclub Süßen e. V."]
[9823,"Sm 2","Herbert","Mazzoli","MGC Köln","","","","","","","1. Minigolf-Club Köln 1961 e. V."]
[50149,"H","Marco","Meffert","MGC Dormagen-Brechten","","","","","","","Minigolfclub Dormagen - Brechten e. V."]
[66216,"H","Christopher","Mehl","MC Ilvesheim","","","","","","","Miniaturgolf-Club Ilvesheim e. V."]
[66329,"Sm 2","Tino","Mehlhorn","Kölner MC","","","","","","","Kölner Miniatur Golf Club e. V."]
[64099,"H","Jan","Mehling","MGV Ansbach","","","","","","","MGV Ansbach e. V."]
[17103,"Sm 2","Uwe","Meier","BGSV Kerpen","","","","","","","Bahnen-Golf-Sport-Vereinigung Kerpen e. V."]
[36229,"Sm 2","Manfred","Meier","BGC Kiel-West","","","","","","","Bahnen-Golf-Club Kiel-West e. V."]
[40719,"Sm 2","Achim","Meier","MGU Neviges","","","","","","","Minigolfunion Neviges-Odenthal 1968 e. V."]
[47267,"Sm 2","Ralf","Meierkord","MGC Bad Salzuflen","","","","","","","Minigolf-Club Bad Salzuflen e. V."]
[87509,"H","Dustin","Meik","MGC Marl","","","","","","","Mini Golf Club Marl 1960 e. V."]
[67770,"Jm","Felix","Meiran","MGC Georgsmarienhütte","","","","","","","Minigolf-Club Georgsmarienhütte e. V."]
[61096,"Sm 2","Manfred","Meißner","MGC Peine","Ja","","","","","","1. Miniaturgolf-Club Peine von 1965 e. V."]
[36232,"Sw 2","Hiltraut","Meissner","MGC Olympia Kiel","","","","","","","Miniaturgolfclub Olympia Kiel e. V."]
[31912,"H","Markus","Meister","MGC Ludwigshafen","","","","","","","1. Miniatur-Golf-Club Ludwigshafen 1964 e. V."]
[50463,"Sm 2","Hans-Peter","Meister","MGC Ludwigshafen","","","","","","","1. Miniatur-Golf-Club Ludwigshafen 1964 e. V."]
[29300,"Sm 2","Werner","Meixner","MGF Hammer","","","","","","","Minigolffreunde Hammer e. V."]
[66705,"Sm 2","Günter","Mendyk","Rot-Weiß Syburg","","","","","","","Rot-Weiß Syburg 1960 e. V."]
[1077,"H","Patrick","Menzel","TSV Salzgitter","Ja","","","","","","Turn- und Sportverein Salzgitter e. V. Abteilung Bahnengolf"]
[36022,"D","Melanie","Menzel","Essener CGC","","","","","","","1. Essener cobiGOLF - Club \"Blau-Gold\" e. V."]
[6066,"Sm 2","Harald","Menzel","MC Rheinhausen","","","","","","","1. Minigolf-Club Rheinhausen e. V."]
[9558,"Sm 2","Bernhard","Merges","MGC Ludwigshafen","","","","","","","1. Miniatur-Golf-Club Ludwigshafen 1964 e. V."]
[66483,"Sw 2","Karin","Merkens","Duisburger MC","","","","","","","1. Duisburger Minigolf Club 1962 e. V."]
[45439,"Sm 1","Carsten","Mertens","KGC Mönchengladbach","","","","","","","1. Klein-Golf-Club Mönchengladbach e. V."]
[35707,"Sm 2","Karl-Heinz","Mertsch","MGC Lohfelden","Ja","","","","","","1. Miniatur-Golfsport-Club Lohfelden e. V."]
[33679,"Sm 2","Peter","Merz","BGC Schweinfurt","","","","","","","Bahnengolfclub Schweinfurt e. V."]
[37881,"Sm 1","Claus","Methner",{"$f":"VLOOKUP(L2050,Kurznamen,2,0)","v":"MGC Metzingen"},{"$f":"IF(VLOOKUP(L2050,Kurznamen,3,0)=\"Ja\",\"Ja\",\"\")","v":""},"","","","","","1. Miniaturgolf Club Metzingen e. V."]
[35351,"Sm 1","Marc","Mette","MC Gelsenkirchen","","","","","","","1. Minigolf Club Gelsenkirchen e. V."]
[50336,"Sm 1","Marcus","Mettler","SSV Ulm","","","","","","","Schwimm- und Sportverein Ulm 1846 e. V. Abteilung Bahnengolf"]
[36983,"H","Marc","Metz","MGC Bad Homburg","","","","","","","Minigolf-Club Bad Homburg e. V."]
[67085,"H","Michael","Meyer","MC Rheinhausen","","","","","","","1. Minigolf-Club Rheinhausen e. V."]
[29486,"Sm 1","Josef","Meyer","BGC Dormagen","","","","","","","Bahnengolf-Club Dormagen e. V."]
[37065,"Sm 1","Matthias","Meyer","MSV Bad Münder/Springe","Ja","","","","","","Minigolf Sport-Verein Bad Münder/Springe von 2005 e. V."]
[41492,"Sm 1","Klaus","Meyer","BGV Bergisch Land","","","","","","","Bahnengolf-Verein Bergisch Land 1962/63 e. V."]
[67298,"Sw 1","Britta","Meyer","CGC Hamm","","","","","","","Cobigolf-Verein Hamm 2019 e. V."]
[36748,"Sm 2","Rolf","Meyer","VfM Bottrop","","","","","","","Verein für Minigolf Bottrop e. V."]
[37944,"Sm 2","Dieter","Meyer","SV Lurup","","","","","","","Sportverein Lurup-Hamburg von 1923 e. V. Abteilung Bahnengolf"]
[67117,"Sm 2","Werner","Meyer","SG Arheilgen","","","","","","","Sportgemeinschaft Arheilgen 1876/1945 e. V. Abteilung Bahnengolf"]
[65621,"Sw 2","Christa","Meyer","BGC Paderborn","","","","","","","1. Bahnengolfclub Paderborn e. V."]
[66816,"Sw 2","Marita","Meyer","MGV Bremen","Ja","","","","","","Miniatur-Golf-Verein Bremen e. V."]
[67631,"Sm 2","Olaf","Michael","MGC Bad Homburg","","","","","","","Minigolf-Club Bad Homburg e. V."]
[67403,"H","Miroslaw","Michalski","MGC Dormagen-Brechten","","","","","","","Minigolfclub Dormagen - Brechten e. V."]
[33682,"Sm 1","Ralf","Michel","MGC Wertheim","","","","","","","Minigolfdub Wertheim ´91 e. V."]
[64086,"Sm 2","Adolf","Michel","BGC Schweinfurt","","","","","","","Bahnengolfclub Schweinfurt e. V."]
[67554,"Sm 2","Peter","Michelmann","BGSV Kerpen","","","","","","","Bahnen-Golf-Sport-Vereinigung Kerpen e. V."]
[41683,"Sw 2","Claudia","Michenfelder","BIG Asperg","","","","","","","Bahnengolf-Interessen-Gemeinschaft Asperg e. V. 1982"]
[33336,"Sm 2","Wolfgang","Michna","MC Möve Cuxhaven","Ja","","","","","","Miniaturgolf-Club \"Möve\" Cuxhaven-Sahlenburg e. V."]
[33337,"Sw 2","Sigrid","Michna","MC Möve Cuxhaven","Ja","","","","","","Miniaturgolf-Club \"Möve\" Cuxhaven-Sahlenburg e. V."]
[67307,"Sm 2","Horst","Miebach","MGC Nümbrecht","","","","","","","Minigolf-Club Nümbrecht e. V. "]
[30858,"Sm 1","Jörg","Mielenz","BGV Bergisch Land","","","","","","","Bahnengolf-Verein Bergisch Land 1962/63 e. V."]
[67720,"Sm 2","Günter","Mikschl","BGC Neutraubling","","","","","","","Bahnengolf-Club Neutraubling e. V."]
[67257,"Sm 1","Frank","Milbers","MGC Mannheim","","","","","","","1. Miniatur-Golf-Club Mannheim 1968 e. V."]
[67266,"Sw 1","Monika","Milbers","MGC Mannheim","","","","","","","1. Miniatur-Golf-Club Mannheim 1968 e. V."]
[8613,"Sm 2","Klaus","Mildenberger","CGC Grötzingen","","","","","","","COBI-GOLF-CLUB Blau-Gelb Grötzingen 1968 e. V."]
[65828,"H","Maximilian","Millhoff","SSC Attendorn","","","","","","","Sterngolf-Sport-Club Attendorn e. V."]
[42588,"Sm 1","Andreas","Minuth","BGC Wolfsburg","Ja","","","","","","1. Bahnen - Golf - Club Wolfsburg e. V."]
[4621,"Sm 2","Karl-Heinz","Minuth","BGC Wolfsburg","Ja","","","","","","1. Bahnen - Golf - Club Wolfsburg e. V."]
[4622,"Sw 2","Hanna","Minuth","BGC Wolfsburg","Ja","","","","","","1. Bahnen - Golf - Club Wolfsburg e. V."]
[25538,"Sm 2","Volker","Missonnier","MGC Mainz","","","","","","","Erster Mainzer Minigolf-Club e. V. 1964"]
[28918,"Sm 2","Udo","Mitscher","MGC Traben-Trarbach","","","","","","","Minigolfclub Traben-Trarbach e. V."]
[38040,"Sm 1","Frank","Mitschke","MC Möve Cuxhaven","Ja",24576,"","","","X","Miniaturgolf-Club \"Möve\" Cuxhaven-Sahlenburg e. V."]
[36005,"Sw 2","Claudia","Mitschke","MGC Bad Salzuflen","","","","","","","Minigolf-Club Bad Salzuflen e. V."]
[66976,"D","Nadja","Mittelhammer","MC Weinheim","","","","","","","1. Miniaturgolf-Club Weinheim e. V."]
[38539,"Sm 1","Stefan","Mittelhammer","MC Weinheim","","","","","","","1. Miniaturgolf-Club Weinheim e. V."]
[27214,"Sm 2","Norbert","Mitterle","TG Höchberg","","","","","","","Turngemeinde Höchberg von 1862 Bahnengolf e. V."]
[35154,"Sm 2","Alfred","Mix","BSV München","","","","","","","Bahnengolfsportverein 86 München e. V."]
[50242,"Sm 1","Joachim","Möbis","BGSV Castrop","","","","","","","Bahnengolfsportverein Castrop e. V. 1961"]
[38091,"Sw 1","Christine","Möbs","MGC Ingolstadt","","","","","",""," Miniaturgolf-Club Ingolstadt e. V."]
[38090,"Sm 2","Lothar","Möbs","MGC Ingolstadt","","","","","",""," Miniaturgolf-Club Ingolstadt e. V."]
[33787,"Sm 2","Jürgen","Möckel","MGC Bad Soden","","","","","","","Miniaturgolfclub Bad Soden-Salmünster e. V."]
[33788,"Sw 2","Jutta","Möckel","MGC Bad Soden","","","","","","","Miniaturgolfclub Bad Soden-Salmünster e. V."]
[67485,"D","Lisa Sabrina","Mohr","MGC Brunsbüttel","","","","","","","Miniaturgolf-Club Brunsbüttel e. V."]
[49769,"Sm 1","Wilfried","Mohr","SC Neumünster","","","","","","","Sportclub Gut Heil Neumünster von 1881 e. V. Abteilung Miniaturgolf"]
[67493,"Sm 1","Wolfgang","Mohr","MGC Brunsbüttel","","","","","","","Miniaturgolf-Club Brunsbüttel e. V."]
[67494,"Sw 1","Ina","Mohr","MGC Brunsbüttel","","","","","","","Miniaturgolf-Club Brunsbüttel e. V."]
[40845,"Sm 2","Jakob","Mois","MGC Murnau","","","","","","","Minigolfclub Murnau am Staffelsee e. V."]
[30348,"Sm 1","Maik","Moll","CGC Grötzingen","","","","","","","COBI-GOLF-CLUB Blau-Gelb Grötzingen 1968 e. V."]
[5649,"Sw 2","Heidi","Moll","CGC Rauschenberg","","","","","","","Cobigolf-Club Rauschenberg e. V."]
[33192,"H","Markus","Möller","MC Künsebeck","","","","","","","Miniaturgolf Club Tigers Künsebeck e. V."]
[37921,"H","David","Möller","MSK Olching","","","","","","","Olchinger Minigolf Sport Klub e. V."]
[3551,"Sm 2","Friedrich-Wilhelm","Möller","BGC Diepholz","Ja","","","","","","Bahnen-Golf-Club Diepholz e. V."]
[17358,"Sm 2","Egon","Möller","BGC Bad Berneck","","","","","","","Bahnengolf-Club e. V. Bad Berneck"]
[17359,"Sm 2","Wolfgang","Möller","MGC Brunsbüttel","","","","","","","Miniaturgolf-Club Brunsbüttel e. V."]
[37430,"H","Karel jr.","Molnár","BGS Hardenberg","","","","","","","BGS Hardenberg-Pötter e. V."]
[31014,"Sw 1","Marion","Mombauer","BGC Uerdingen","","","","","","","Bahnengolf-Club Uerdingen e. V."]
[67202,"Schm","Felix Leon","Mönnig","CGC Rauschenberg","","","","","","","Cobigolf-Club Rauschenberg e. V."]
[26414,"Sm 1","Richard","Mönning","MGC Epe","","","","","","","1. Minigolfclub Epe 1978 e. V."]
[38208,"H","Tobias","Montberg","MSC Wesel","","","","","","","1. Minigolf-Sportclub Wesel 66 66 e. V. "]
[38230,"H","Jan-Niclas","Moosmann","BGV Rodalben","","","","","","","1. Bahnengolfverein Rodalben 1977 e. V."]
[67707,"H","Daniel","Moosmann","BGV Rodalben","","","","","","","1. Bahnengolfverein Rodalben 1977 e. V."]
[37444,"D","Katharina","Moosmann",{"$f":"VLOOKUP(L2114,Kurznamen,2,0)","v":"BGV Rodalben"},{"$f":"IF(VLOOKUP(L2114,Kurznamen,3,0)=\"Ja\",\"Ja\",\"\")","v":""},"","","","","","1. Bahnengolfverein Rodalben 1977 e. V."]
[40668,"Sm 1","Mathias","Moosmann","BGV Rodalben","","","","","","","1. Bahnengolfverein Rodalben 1977 e. V."]
[36211,"Sw 1","Stefanie","Moosmann","BGV Rodalben","","","","","","","1. Bahnengolfverein Rodalben 1977 e. V."]
[12100,"Sm 2","Hans","Mordhorst","VfM Berlin","","","","","","","Verein für Minigolf e. V. Berlin"]
[17884,"Sw 2","Rosemarie","Mordhorst","VfM Berlin","","","","","","","Verein für Minigolf e. V. Berlin"]
[67348,"Sm 2","Ruggiero","Morelli","MGC Ludwigshafen","","","","","","","1. Miniatur-Golf-Club Ludwigshafen 1964 e. V."]
[25840,"Sw 2","Angela","Morgenstern","BGS Hardenberg","","","","","","","BGS Hardenberg-Pötter e. V."]
[36599,"Sw 2","Brigitte","Morhardt","MGC Metzingen","","","","","","","1. Miniaturgolf Club Metzingen e. V."]
[67020,"Sm 1","Rainer","Moritz","BGC Schweinfurt","","","","","","","Bahnengolfclub Schweinfurt e. V."]
[66564,"H","Daniel","Mörixbauer","MGC Süßen","","","","","","","1. Miniaturgolfclub Süßen e. V."]
[66727,"Sm 2","Jürgen","Mörixbauer","MGC Süßen","","","","","","","1. Miniaturgolfclub Süßen e. V."]
[37808,"H","Kevin","Morschick","BGC Dormagen","","","","","","","Bahnengolf-Club Dormagen e. V."]
[37807,"Sm 2","Detlef","Morschick","BGC Dormagen","","","","","","","Bahnengolf-Club Dormagen e. V."]
[42254,"Sm 1","Rüdiger","Moser","VfM Bottrop","","","","","","","Verein für Minigolf Bottrop e. V."]
[66421,"H","Colin","Mössinger","BGSV Kerpen","","","","","","","Bahnen-Golf-Sport-Vereinigung Kerpen e. V."]
[67495,"Sw 1","Sigrun","Mössinger","CGC Grötzingen","","","","","","","COBI-GOLF-CLUB Blau-Gelb Grötzingen 1968 e. V."]
[36162,"Sm 2","Philipp","Most","MGC Bad Bocklet","","","","","","","Miniatur-Golf-Club \"Stahlquelle\", Bad Bocklet 1989 e. V."]
[38557,"H","Alexander","Mrohs","NDE Miniaturgolf","","","","","","","Niendorfer Miniaturgolf-Club von 1963 e. V."]
[28527,"Sm 2","Martin","Much","MSK Neheim-Hüsten","","","","","","","MINIGOLF-SPORT-KLUB Neheim-Hüsten e. V."]
[40247,"H","Jan","Muckenhaupt","SSC Attendorn","","","","","","","Sterngolf-Sport-Club Attendorn e. V."]
[43491,"Sm 2","Willy","Mühlberg","SV Lurup","","","","","","","Sportverein Lurup-Hamburg von 1923 e. V. Abteilung Bahnengolf"]
[29511,"Sm 1","Dirk","Mühlenbeck","HMC Büttgen","","","","","","","Hobbysport Miniaturgolfclub Büttgen e. V."]
[49369,"Sm 2","Dirk","Mühling","CGC Hamm","","","","","","","Cobigolf-Verein Hamm 2019 e. V."]
[66557,"Sm 2","Peter","Mühlstein","BGC Landshut","","","","","","","1. Bahnengolf-Club Landshut e. V."]
[66559,"Sm 2","Wolfgang","Mühlstein","BGC Landshut","","","","","","","1. Bahnengolf-Club Landshut e. V."]
[67226,"Sw 2","Renate","Mühlstein","BGC Landshut","","","","","","","1. Bahnengolf-Club Landshut e. V."]
[38076,"Sm 2","Peter","Mulfinger","MGC Bad Feilnbach","","","","","","","Minigolfclub Bad Feilnbach e. V."]
[65620,"Sw 2","Karin","Mulfinger","MGC Bad Feilnbach","","","","","","","Minigolfclub Bad Feilnbach e. V."]
[20828,"Sm 2","Hans Dieter","Müllen","MGC Traben-Trarbach","","","","","","","Minigolfclub Traben-Trarbach e. V."]
[32762,"H","Björn","Müller","MC Möve Cuxhaven","Ja","","","","","","Miniaturgolf-Club \"Möve\" Cuxhaven-Sahlenburg e. V."]
[33774,"H","Patrick","Müller","MSC Bad Godesberg","","","","","","","Minigolf-Sport-Club Bad Godesberg e. V."]
[48182,"H","Dirk","Müller","HMC Büttgen","","","","","","","Hobbysport Miniaturgolfclub Büttgen e. V."]
[38330,"H","Yannick","Müller","BGS Hardenberg","","","","","","","BGS Hardenberg-Pötter e. V."]
[34616,"D","Laura","Müller","MGC Ludwigshafen","","","","","","","1. Miniatur-Golf-Club Ludwigshafen 1964 e. V."]
[26535,"Sm 1","Klaus","Müller","MGF Hilzingen","","","","","","","Minigolffreunde Hilzingen 80 e. V."]
[29586,"Sm 1","Stefan","Müller","BGSV Kerpen","","","","","","","Bahnen-Golf-Sport-Vereinigung Kerpen e. V."]
[41049,"Sm 1","Volker","Müller","CKF Dudweiler","","","","","","","l. Club der Kleingolf - Freunde Dudweiler e. V."]
[46141,"Sm 1","Michael","Müller","MGC Bad Feilnbach","","","","","","","Minigolfclub Bad Feilnbach e. V."]
[46389,"Sm 1","Ralf","Müller","Reinickendorfer MGC","","","","","","","Reinickendorfer Miniatur - Golfsport - Club e. V."]
[65865,"Sm 1","Markus","Müller","MGU Neviges","","","","","","","Minigolfunion Neviges-Odenthal 1968 e. V."]
[67760,"Sm 1","Frank","Müller","BGC Paffendorf","","","","","","","Bahnengolf Club Schloß Paffendorf e. V."]
[67761,"Sw 1","Viola","Müller","BGC Paffendorf","","","","","","","Bahnengolf Club Schloß Paffendorf e. V."]
[18367,"Sm 2","Wolfgang","Müller","BGC Celle","Ja","","","","","","1. Bahnen-Golf-Club Celle von 1964 e. V."]
[27319,"Sm 2","Friedrich","Müller","MGC Paderborn","","","","","","","1. Minigolf-Club Paderborn 1980 e. V."]
[40622,"Sm 2","Peter","Müller","MC Schriesheim","","","","","","","Miniaturgolf Sportclub Schriesheim e. V."]
[40912,"Sm 2","Axel","Müller","KC Homburg","","","","","","","1. Kleingolf Club Homburg-Saar 1967 e. V."]
[45001,"Sm 2","Michael","Müller","MC Lüdenscheid","","","","","","","MC 62 Lüdenscheid e. V."]
[66176,"Sm 2","Michael","Müller","SC Bad Münder","Ja","","","","","","Sportclub Bad Münder e. V. Abteilung Bahnengolf"]
[66322,"Sm 2","Uwe","Müller","MGC Wanne-Eickel","","","","","","","Minigolfclub Rot-Weiß Wanne-Eickel e. V."]
[34489,"Sw 2","Elli","Müller","MSC Bad Godesberg","","","","","","","Minigolf-Sport-Club Bad Godesberg e. V."]
[67593,"Sw 2","Anna","Müller","Duisburger MC","","","","","","","1. Duisburger Minigolf Club 1962 e. V."]
[34023,"H","Sascha","Müller-Zentz","BGC Bildstock","","","","","","","Bahnen-Golf-Club Bildstock e. V."]
[43367,"Sm 2","Michael","Müllner","MC Ilvesheim","","","","","","","Miniaturgolf-Club Ilvesheim e. V."]
[65375,"Jw","Anna Lena","Münch","KC Homburg","","","","","","","1. Kleingolf Club Homburg-Saar 1967 e. V."]
[46494,"Sm 2","Roman","Münch","KC Homburg","","","","","","","1. Kleingolf Club Homburg-Saar 1967 e. V."]
[67175,"Schm","Farin","Münchhoff","MGC Ingolstadt","","","","","",""," Miniaturgolf-Club Ingolstadt e. V."]
[25741,"Sm 2","Christian","Münster","MGC Diessen","","","","","","","Minigolf-Club Diessen e. V."]
[44517,"Sm 2","Raimund","Mürhoff","MGC Paderborn","","","","","","","1. Minigolf-Club Paderborn 1980 e. V."]
[67806,"Sw 1","Rafaela","Musielak","BGSC Gladbeck","","","","","","","Bahnengolfsportclub \"Gut Schlag\" Gladbeck e. V."]
[67805,"Sm 2","Jürgen","Musielak","BGSC Gladbeck","","","","","","","Bahnengolfsportclub \"Gut Schlag\" Gladbeck e. V."]
[67122,"H","Pascal","Mutsch","MGC Metzingen","","","","","","","1. Miniaturgolf Club Metzingen e. V."]
[67581,"H","Sebastian","Mützel","BGC Schweinfurt","","","","","","","Bahnengolfclub Schweinfurt e. V."]
[1090,"H","Hendrik","Mylius","MGV Bremen","Ja","","","","","","Miniatur-Golf-Verein Bremen e. V."]
[40393,"Sm 1","Uwe","Mylius","BGC Bremen","Ja","","","","","","Bahnen-Golf-Club Bremen e. V."]
[1641,"Sm 2","Frank","Mylius",{"$f":"VLOOKUP(L2178,Kurznamen,2,0)","v":"MGV Bremen"},{"$f":"IF(VLOOKUP(L2178,Kurznamen,3,0)=\"Ja\",\"Ja\",\"\")","v":"Ja"},"","","","","","Miniatur-Golf-Verein Bremen e. V."]
[40898,"Sw 2","Marion","Mylius","MGV Bremen","Ja","","","","","","Miniatur-Golf-Verein Bremen e. V."]
[26399,"Sm 2","Norbert","Naber","MGC Epe","","","","","","","1. Minigolfclub Epe 1978 e. V."]
[32405,"H","Dirk","Nacke","MC Gelsenkirchen","","","","","","","1. Minigolf Club Gelsenkirchen e. V."]
[42563,"Sm 1","Udo","Nagl","BGC Landshut","","","","","","","1. Bahnengolf-Club Landshut e. V."]
[42569,"Sw 1","Sabine","Nagl","BGC Landshut","","","","","","","1. Bahnengolf-Club Landshut e. V."]
[33110,"Sm 2","Xaver","Nagler","MGC Unterschneidheim","","","","","","","Minigolfclub Unterschneidheim e. V."]
[36824,"Sm 2","Martin","Nagler","MGC Unterschneidheim","","","","","","","Minigolfclub Unterschneidheim e. V."]
[35773,"Sm 2","Wolf-Dieter","Nähler","MGC Köln","","","","","","","1. Minigolf-Club Köln 1961 e. V."]
[45049,"Sm 1","Dirk Willi","Nebe","BGSC Gladbeck","","","","","","","Bahnengolfsportclub \"Gut Schlag\" Gladbeck e. V."]
[29219,"Sm 1","Kurt","Nees","MGC Schwaikheim","","","","","","","Miniaturgolf – Club Schwaikheim e. V."]
[66624,"Sm 2","Ernst-Georg","Negwer","BGC Schweinfurt","","","","","","","Bahnengolfclub Schweinfurt e. V."]
[66623,"Sw 2","Ursula","Negwer","BGC Schweinfurt","","","","","","","Bahnengolfclub Schweinfurt e. V."]
[67714,"Schm","Luis","Neidenberger","MGC Peine","Ja","","","","","","1. Miniaturgolf-Club Peine von 1965 e. V."]
[27505,"Sm 1","Stefan","Neidig","MGC Mannheim","","","","","","","1. Miniatur-Golf-Club Mannheim 1968 e. V."]
[66269,"Jm","Niklas","Nell","MGC Bad Waldsee","","","","","","","Minigolf-Club Bad Waldsee 1990 e. V."]
[33042,"Sm 1","Roland","Nell","MGC Bad Waldsee","","","","","","","Minigolf-Club Bad Waldsee 1990 e. V."]
[66360,"H","Benjamin","Nelles","BGC Wolfsburg","Ja",28407,"X","","","","1. Bahnen - Golf - Club Wolfsburg e. V."]
[45733,"Sw 2","Ingrid","Netzband","MGC Metzingen","","","","","","","1. Miniaturgolf Club Metzingen e. V."]
[37611,"D","Erika","Neuburger","SSV Ulm","","","","","","","Schwimm- und Sportverein Ulm 1846 e. V. Abteilung Bahnengolf"]
[37027,"Sm 1","Andreas","Neuburger","SSV Ulm","","","","","","","Schwimm- und Sportverein Ulm 1846 e. V. Abteilung Bahnengolf"]
[66301,"H","Dennis","Neudert","BGC Illertissen","","","","","","","Bahnengolfclub Illertissen e. V."]
[43062,"Sm 1","Oliver","Neudert","BGC Illertissen","","","","","","","Bahnengolfclub Illertissen e. V."]
[37047,"H","Marvin","Neufeld","MSK Neheim-Hüsten","","","","","","","MINIGOLF-SPORT-KLUB Neheim-Hüsten e. V."]
[48942,"Sm 1","Dieter","Neuhäuser","VfB Osnabrück","","","","","","","Verein für Bahnengolf Osnabrück von 1984 e. V."]
[25784,"Sm 1","Michael","Neuland","MGC Dormagen-Brechten","","","","","","","Minigolfclub Dormagen - Brechten e. V."]
[29733,"H","Björn","Neumann","MC Möve Cuxhaven","Ja","","","","","","Miniaturgolf-Club \"Möve\" Cuxhaven-Sahlenburg e. V."]
[37955,"H","Lukas","Neumann","MGC Mainz","","","","","","","Erster Mainzer Minigolf-Club e. V. 1964"]
[38363,"H","Kevin","Neumann","BGC Celle","Ja",26535,"X","","","","1. Bahnen-Golf-Club Celle von 1964 e. V."]
[32139,"D","Kathrin","Neumann","MGC Mainz","","","","","","","Erster Mainzer Minigolf-Club e. V. 1964"]
[37667,"Sm 1","Christian","Neumann","MGC Murnau","","","","","","","Minigolfclub Murnau am Staffelsee e. V."]
[37668,"Sm 1","Michael","Neumann","MGC Murnau","","","","","","","Minigolfclub Murnau am Staffelsee e. V."]
[42783,"Sm 1","Josef","Neumann","OMGC Imgolstadt","","","","","","","Oberbayerische Minigolf-Club Ingolstadt e. V."]
[66340,"Sm 1","Reiner","Neumann","BGC Bremen","Ja","","","","","","Bahnen-Golf-Club Bremen e. V."]
[35213,"Sm 2","Uwe","Neumann","BGC Bremen","Ja","","","","","","Bahnen-Golf-Club Bremen e. V."]
[37168,"Sm 2","Michael","Neumann","RKV Rheinstetten","","","","","","","Rad- und Kraftfahrervereins \"Solidarität\" Mörsch e. V. Abteilung Minigolf Wölfe Rheinstetten 02"]
[33165,"Sw 2","Bärbel","Neumann","Tempelhofer MV","","","","","","","Tempelhofer Miniaturgolf Verein von 1965 e. V."]
[65576,"Sw 2","Sabine","Neumann","BGC Celle","Ja",26534,"X","","","X","1. Bahnen-Golf-Club Celle von 1964 e. V."]
[67153,"Sw 2","Angelika","Neumann","BGC Wolfsburg","Ja","","","","","","1. Bahnen - Golf - Club Wolfsburg e. V."]
[28030,"Sm 1","Ralf","Neuwald","MC Schriesheim","","","","","","","Miniaturgolf Sportclub Schriesheim e. V."]
[65600,"H","Fabian","Neuwirth","BGC Illertissen","","","","","","","Bahnengolfclub Illertissen e. V."]
[37473,"Sm 1","Waldemar","Neuwirth","MGC Dormagen-Brechten","","","","","","","Minigolfclub Dormagen - Brechten e. V."]
[65599,"Sm 2","Dietmar","Neuwirth","BGC Illertissen","","","","","","","Bahnengolfclub Illertissen e. V."]
[66071,"H","Thomas","Nichter","BIG Asperg","","","","","","","Bahnengolf-Interessen-Gemeinschaft Asperg e. V. 1982"]
[38005,"H","Dustin","Nickel","MGC Wetzlar","","","","","","","Miniatur-Golf-Club Wetzlar e. V."]
[46042,"Sm 1","Holger","Nickel","MGC Homburger Land","","","","","","","MGC Homburger Land e. V."]
[37288,"Sm 2","Dieter","Nickel","PTSV Hof","","","","","","","Post- und Telekom-Sportverein Hof e. V. Abteilung Minigolf "]
[46152,"Sm 2","Gerhard","Nickel","MGC Wetzlar","","","","","","","Miniatur-Golf-Club Wetzlar e. V."]
[66601,"Jm","David","Nickerl","MGC München","","","","","","","1. Miniaturgolfclub München-Feldmoching e. V."]
[46446,"Sm 1","Matthias","Nickerl","MGC Veitshöchheim","","","","","","","Miniaturgolfclub Veitshöchheim e. V."]
[48138,"Sm 1","Alfred","Nickerl","MGC München","","","","","","","1. Miniaturgolfclub München-Feldmoching e. V."]
[46123,"Sm 2","Piergiorgio","Nicolazzi","MGC Murnau","","","","","","","Minigolfclub Murnau am Staffelsee e. V."]
[40306,"Sm 2","Richard","Niebler","BGC Neutraubling","","","","","","","Bahnengolf-Club Neutraubling e. V."]
[66206,"Sm 1","Jörg","Niebuhr","BGC Northeim","Ja",28159,"X","","","","Bahnen-Golf-Club Northeim e. V."]
[11191,"Sm 2","Dieter","Niederdräing","MGC Felderbachtal","","","","","","","Minigolf-Club-Felderbachtal 1964 e. V."]
[42044,"Sm 1","Andreas","Niedermeir","MGC München","","","","","","","1. Miniaturgolfclub München-Feldmoching e. V."]
[42046,"Sm 1","Martin","Niedermeir","MGC München","","","","","","","1. Miniaturgolfclub München-Feldmoching e. V."]
[37610,"Sm 2","Roland","Niedl","BGC Illertissen","","","","","","","Bahnengolfclub Illertissen e. V."]
[67712,"Sm 1","Dirk","Niehaus","SSC Halver","","","","","","","SSC Halver e. V."]
[45006,"Sm 1","Thorsten","Niemann","MGC Bad Oldesloe","","","","","","","Miniaturgolfclub Bad Oldesloe von 1964 e. V."]
[52000,"Sm 1","Uwe","Niemtschke","TSV Arendsee","","","","","","","Turn- und Sportverein Arendsee e. V. Abteilung Minigolf"]
[66579,"Sw 1","Susanne","Niepel","MGC Wanne-Eickel","","","","","","","Minigolfclub Rot-Weiß Wanne-Eickel e. V."]
[67392,"Sm 2","Jean-Luc","Nihoul","BGS Hardenberg","","","","","","","BGS Hardenberg-Pötter e. V."]
[34408,"D","Sandra","Nikolaus","BGV Rodalben","","","","","","","1. Bahnengolfverein Rodalben 1977 e. V."]
[37551,"Sm 1","Michael","Nischk",{"$f":"VLOOKUP(L2242,Kurznamen,2,0)","v":"MGC Bad Homburg"},{"$f":"IF(VLOOKUP(L2242,Kurznamen,3,0)=\"Ja\",\"Ja\",\"\")","v":""},"","","","","","Minigolf-Club Bad Homburg e. V."]
[67311,"Sw 1","Britta","Nischk","MGC Bad Homburg","","","","","","","Minigolf-Club Bad Homburg e. V."]
[37550,"Sw 2","Erika","Nischk","MGC Bad Homburg","","","","","","","Minigolf-Club Bad Homburg e. V."]
[45189,"Sm 1","Holger","Nitsche","MGC Epe","","","","","","","1. Minigolfclub Epe 1978 e. V."]
[43542,"Sm 1","Thomas","Nix","BIG Asperg","","","","","","","Bahnengolf-Interessen-Gemeinschaft Asperg e. V. 1982"]
[31269,"H","Marcel","Noack","MGC Mainz","","","","","","","Erster Mainzer Minigolf-Club e. V. 1964"]
[67214,"H","Danny","Noack","MGC Karlshagen","","","","","","","Minigolfclub Karlshagen e. V."]
[66971,"Schm","Nevio","Noack","MGC Karlshagen","","","","","","","Minigolfclub Karlshagen e. V."]
[34191,"Sm 2","Günter","Noack","MGC Mainz","","","","","","","Erster Mainzer Minigolf-Club e. V. 1964"]
[23517,"Sm 2","Frank","Noch","Tempelhofer MV","","","","","","","Tempelhofer Miniaturgolf Verein von 1965 e. V."]
[23516,"Sw 2","Christiane","Noch","Tempelhofer MV","","","","","","","Tempelhofer Miniaturgolf Verein von 1965 e. V."]
[35738,"Sm 1","Harald","Nohr","BGC Celle","Ja","","","","","","1. Bahnen-Golf-Club Celle von 1964 e. V."]
[67785,"D","Jeanette","Nöth","MGV Ansbach","","","","","","","MGV Ansbach e. V."]
[67028,"Jm","Johannes","Nöth","MGV Ansbach","","","","","","","MGV Ansbach e. V."]
[67026,"Sm 2","Michael","Nöth","MGV Ansbach","","","","","","","MGV Ansbach e. V."]
[5511,"Sm 2","Wilfried","Nowak","MSK Neheim-Hüsten","","","","","","","MINIGOLF-SPORT-KLUB Neheim-Hüsten e. V."]
[38541,"Sm 2","Alfred","Nowak","BGC Bochum","","","","","","","Bahnengolf-Sportclub Bochum 1978 e. V."]
[21500,"Sw 2","Marion","Nowak","MSK Neheim-Hüsten","","","","","","","MINIGOLF-SPORT-KLUB Neheim-Hüsten e. V."]
[30639,"Sm 1","Peter","Nowsky","MGC Göttingen","Ja","","","","","","1. Miniatur-Golfsport-Club 1970 Göttingen e. V."]
[66272,"Sw 2","Beatrix","Numberger","Münchener MC","","","","","","","1. Münchener Minigolf-Club 1962 e. V."]
[43054,"Sm 2","Martin","Nuri-Kälble","BSV Ohlsbach","","","","","","","Bahnengolfsportverein 82 Ohlsbach e. V."]
[33491,"Sm 2","Rolf","Nutzenberger","MGC Mannheim","","","","","","","1. Miniatur-Golf-Club Mannheim 1968 e. V."]
[33385,"Sm 2","Hermann","Oberding","Biskirchener BGV","","","","","","","Biskirchener Bahnen-Golf-Verein e. V."]
[42510,"Sm 1","Frank","Oberhofer","MGF Hammer","","","","","","","Minigolffreunde Hammer e. V."]
[67644,"Sw 2","Ursula","Oberle","RKV Rheinstetten","","","","","","","Rad- und Kraftfahrervereins \"Solidarität\" Mörsch e. V. Abteilung Minigolf Wölfe Rheinstetten 02"]
[67711,"H","Maximilian ","Obermeier","BGC Hannover","Ja","","","","","","1. Bahnen-Golf-Club Hannover e. V."]
[67710,"Sm 1","Carsten","Obermeier","BGC Hannover","Ja","","","","","","1. Bahnen-Golf-Club Hannover e. V."]
[67500,"Sm 1","Walter","Oberthanner","Hamburger MC","","","","","","","Hamburger Minigolf Club von 1965 e. V."]
[36180,"H","Felix","Oehl","MV Lankwitzer Dragons","","","","","","","MV Lankwitzer Dragons e. V."]
[40827,"Sm 2","Torsten","Offner","Hamburger MC","","","","","","","Hamburger Minigolf Club von 1965 e. V."]
[66701,"Sm 1","Roland","Ohletz","BGC Uerdingen","","","","","","","Bahnengolf-Club Uerdingen e. V."]
[38373,"Sw 2","Jutta","Ohly","MGC Metzingen","","","","","","","1. Miniaturgolf Club Metzingen e. V."]
[29928,"Sm 1","Hans-Peter","Ohm","SV Gebhardshagen","Ja","","","","","","SV Glück Auf 1901 Gebhardshagen e. V. Abteilung Minigolf"]
[67676,"Sm 2","Wolfgang","Ohnesorge","MGC Wetzlar","","","","","","","Miniatur-Golf-Club Wetzlar e. V."]
[35023,"Sw 2","Edith","Oitzinger","BV Sennestadt","","","","","","","BV Sennestadt e. V."]
[45418,"Sw 2","Carola","Oklmann","SSV Ulm","","","","","","","Schwimm- und Sportverein Ulm 1846 e. V. Abteilung Bahnengolf"]
[30123,"Sm 2","Michael","Olböter","Essener CGC","","","","","","","1. Essener cobiGOLF - Club \"Blau-Gold\" e. V."]
[66809,"H","Torben","Oldhafer","MSK Neheim-Hüsten","","","","","","","MINIGOLF-SPORT-KLUB Neheim-Hüsten e. V."]
[1170,"H","Dirk","Onnen","BGC Hannover","Ja","","","","","","1. Bahnen-Golf-Club Hannover e. V."]
[42114,"Sm 1","Stefan","Opitz","BGC Hannover","Ja","","","","","","1. Bahnen-Golf-Club Hannover e. V."]
[35803,"Sw 2","Brigitte","Opitz","MGC Peine","Ja","","","","","","1. Miniaturgolf-Club Peine von 1965 e. V."]
[34733,"H","David","Oppermann","BSC Ennepetal","","","","","","","Bahngolf-Sport-Club Ennepetal e. V."]
[22422,"Sm 2","Ralf","Oppermann","BSC Ennepetal","","","","","","","Bahngolf-Sport-Club Ennepetal e. V."]
[29740,"Sm 1","Arne","Oppmann","MGC Würzburg","","","","","","","Miniaturgolfsportverein Würzburg - Löwenbrücke e. V."]
[40264,"Sm 1","Harald","Orth","MSV Bad Kreuznach","","","","","","","MSV Bad Kreuznach e. V."]
[29215,"Sm 1","Ingo","Ortner","MGC Schwaikheim","","","","","","","Miniaturgolf – Club Schwaikheim e. V."]
[45103,"Sm 1","Michael","Oseit","MC Weinheim","","","","","","","1. Miniaturgolf-Club Weinheim e. V."]
[26349,"Sm 2","Jörn","Osnabrügge","MGC Ludwigshafen","","","","","","","1. Miniatur-Golf-Club Ludwigshafen 1964 e. V."]
[67458,"Sm 2","Gerd","Oßendorf","Porzer MGC","","","","","","","1. Porzer Minigolfclub Grün-Weiß 1969 e. V."]
[3358,"Sm 2","Karl-Heinz","Oster","Porzer MGC","","","","","","","1. Porzer Minigolfclub Grün-Weiß 1969 e. V."]
[66338,"Sw 1","Gabriele","Osthushenrich","BGC Hannover","Ja","","","","","","1. Bahnen-Golf-Club Hannover e. V."]
[30224,"H","Hans-Jörg","Ott","BGC Bad Berneck","","","","","","","Bahnengolf-Club e. V. Bad Berneck"]
[31026,"H","David","Ott","BGV Backumer Tal","","","","","","","BGV Backumer Tal Herten e. V."]
[31031,"H","Andy","Ott","BGV Backumer Tal","","","","","","","BGV Backumer Tal Herten e. V."]
[36193,"H","Philipp","Ott","BGSV Castrop","","","","","","","Bahnengolfsportverein Castrop e. V. 1961"]
[9296,"Sm 2","Norbert","Ott","BGV Backumer Tal","","","","","","","BGV Backumer Tal Herten e. V."]
[29114,"Sm 1","Dirk","Otten","TSV Salzgitter","Ja",8983,"","X","","","Turn- und Sportverein Salzgitter e. V. Abteilung Bahnengolf"]
[28901,"Sw 1","Sabine","Otten","BGC Wolfsburg","Ja",8869,"","X","","","1. Bahnen - Golf - Club Wolfsburg e. V."]
[48281,"Sm 1","Stefan","Ottinger","MGC Murnau","","","","","","","Minigolfclub Murnau am Staffelsee e. V."]
[32793,"D","Meike","Otto","MGC Olympia Kiel","","","","","","","Miniaturgolfclub Olympia Kiel e. V."]
[151,"Sm 2","Herbert","Otto","MGC Wanne-Eickel","","","","","","","Minigolfclub Rot-Weiß Wanne-Eickel e. V."]
[6524,"Sm 2","Kuno","Otto","MGC Olympia Kiel","","","","","","","Miniaturgolfclub Olympia Kiel e. V."]
[25020,"Sw 2","Karin","Otto","MGC Olympia Kiel","","","","","","","Miniaturgolfclub Olympia Kiel e. V."]
[67173,"Sw 1","Petra","Ovzarek","CGC Grötzingen","","","","","","","COBI-GOLF-CLUB Blau-Gelb Grötzingen 1968 e. V."]
[67174,"Sm 2","Wolfgang","Ovzarek",{"$f":"VLOOKUP(L2306,Kurznamen,2,0)","v":"CGC Grötzingen"},{"$f":"IF(VLOOKUP(L2306,Kurznamen,3,0)=\"Ja\",\"Ja\",\"\")","v":""},"","","","","","COBI-GOLF-CLUB Blau-Gelb Grötzingen 1968 e. V."]
[66565,"Jm","Ben","Paffrath","MGC Heven","","","","","","","Miniatur - Golf - Club Heven e. V."]
[33511,"Sm 2","Siegfried","Paffrath","MGC Heven","","","","","","","Miniatur - Golf - Club Heven e. V."]
[21494,"Sm 2","Horst","Pahl","MSK Neheim-Hüsten","","","","","","","MINIGOLF-SPORT-KLUB Neheim-Hüsten e. V."]
[61978,"Sm 2","Heinz","Pahl","BGC Celle","Ja","","","","","","1. Bahnen-Golf-Club Celle von 1964 e. V."]
[28473,"Sw 2","Gabi","Pahl","BGC Celle","Ja","","","","","","1. Bahnen-Golf-Club Celle von 1964 e. V."]
[37073,"H","Kim-Kevin","Pajonk","TSV Arendsee","","","","","","","Turn- und Sportverein Arendsee e. V. Abteilung Minigolf"]
[37072,"Sw 1","Kathi","Pajonk","TSV Arendsee","","","","","","","Turn- und Sportverein Arendsee e. V. Abteilung Minigolf"]
[5757,"Sm 2","Klaus Peter","Palm","KC Homburg","","","","","","","1. Kleingolf Club Homburg-Saar 1967 e. V."]
[35611,"H","Olaf","Paltian","MGC Ludwigshafen","","","","","","","1. Miniatur-Golf-Club Ludwigshafen 1964 e. V."]
[50042,"H","Christian","Pannek","MGC Mainz","","","","","","","Erster Mainzer Minigolf-Club e. V. 1964"]
[37578,"H","Marc","Pape","KC Homburg","","","","","","","1. Kleingolf Club Homburg-Saar 1967 e. V."]
[66902,"Jm","Robert-Alexander","Pape","Elbhavelland","","","","","","","Elbhavelland e. V. Abteilung Minigolfsport"]
[36258,"Sm 2","Ronald","Pape","MGF Magdeburg","","","","","","","Minigolffreunde Magdeburg e. V."]
[67289,"Sm 2","Ulrich","Pape","MSV Bad Kreuznach","","","","","","","MSV Bad Kreuznach e. V."]
[67330,"Sm 2","Jürgen","Pape","Elbhavelland","","","","","","","Elbhavelland e. V. Abteilung Minigolfsport"]
[67331,"Sw 2","Christina","Pape","Elbhavelland","","","","","","","Elbhavelland e. V. Abteilung Minigolfsport"]
[9750,"Sw 1","Sylvia","Pape-Münch","KC Homburg","","","","","","","1. Kleingolf Club Homburg-Saar 1967 e. V."]
[67689,"Sm 1","Andre","Pappers","KGC Mönchengladbach","","","","","","","1. Klein-Golf-Club Mönchengladbach e. V."]
[28746,"Sm 2","Karsten","Parbst","VfL Lohbrügge","","","","","","","Verein für Leibesübungen Lohbrügge von 1892 e. V. Abteilung Bahnengolf"]
[30259,"Sw 2","Monika","Parbst","VfL Lohbrügge","","","","","","","Verein für Leibesübungen Lohbrügge von 1892 e. V. Abteilung Bahnengolf"]
[33393,"Sw 1","Susanne","Parr","MSC Bensheim-Auerbach","","","","","","","Minigolf-Sport-Club Bensheim-Auerbach e. V."]
[40114,"H","Daniel","Patan","BIG Asperg","","","","","","","Bahnengolf-Interessen-Gemeinschaft Asperg e. V. 1982"]
[66771,"D","Franziska","Patan","BIG Asperg","","","","","","","Bahnengolf-Interessen-Gemeinschaft Asperg e. V. 1982"]
[51850,"Sm 1","Bernhard","Patan","BIG Asperg","","","","","","","Bahnengolf-Interessen-Gemeinschaft Asperg e. V. 1982"]
[55130,"Sw 1","Sabine","Patan","BIG Asperg","","","","","","","Bahnengolf-Interessen-Gemeinschaft Asperg e. V. 1982"]
[67432,"Sm 1","Ralf","Paternusch","MGC Remseck","","","","","","","Miniaturgolf-Club 1978 Remseck a.N. e. V."]
[35530,"H","Marcel","Patorra","BGC Bad Nenndorf","Ja","","","","","","Bahnen-Golf-Club Bad Nenndorf e. V."]
[66577,"H","Michael","Pätz","BGC Bad Füssing","","","","","","","1. Bahnengolfclub Bad Füssing e. V."]
[46006,"Sm 1","Markus","Patzelt","BGSV Kerpen","","","","","","","Bahnen-Golf-Sport-Vereinigung Kerpen e. V."]
[67213,"Sm 1","Gerd","Paul","MGC Bad Homburg","","","","","","","Minigolf-Club Bad Homburg e. V."]
[33153,"Sm 1","Lars","Paulsen","MGC Harrislee","","","","","","","Sportverein Minigolfclub Harrislee-Wassersleben e. V."]
[49350,"Sm 1","Achim","Paulsen","MGC Olympia Kiel","","","","","","","Miniaturgolfclub Olympia Kiel e. V."]
[50354,"Sm 2","Steffen","Paulus","KGC Bad Urach","","","","","","","Klein-Golf-Club Bad Urach e. V."]
[36042,"Sw 2","Cornelia","Päuser","MGC Kassel","Ja",14051,"","X","","","1. Mini-Golfsport-Club Kassel-Vellmar 1964 e. V."]
[4744,"Sm 2","Rudolf","Pavlas","MSV Bad Kreuznach","","","","","","","MSV Bad Kreuznach e. V."]
[66726,"H","Nicolas","Pawelka","MC Schriesheim","","","","","","","Miniaturgolf Sportclub Schriesheim e. V."]
[66223,"Sm 1","Stephan","Pawelka","MC Schriesheim","","","","","","","Miniaturgolf Sportclub Schriesheim e. V."]
[34757,"H","Sebastian","Peffer","NDE Miniaturgolf","","","","","","","Niendorfer Miniaturgolf-Club von 1963 e. V."]
[34562,"Sm 2","Willi","Peffer","BGC Weseling","","","","","","","1. Bahnen-Golf-Club Wesseling 1975 e. V. "]
[33490,"Sm 2","Kurt","Peinelt","MGC Ludwigshafen","","","","","","","1. Miniatur-Golf-Club Ludwigshafen 1964 e. V."]
[67443,"Jm","Jan","Peithmann","Essener CGC","","","","","","","1. Essener cobiGOLF - Club \"Blau-Gold\" e. V."]
[67442,"Schw","Wiebke","Peithmann","Essener CGC","","","","","","","1. Essener cobiGOLF - Club \"Blau-Gold\" e. V."]
[67444,"Sm 1","Konrad","Peithmann","Essener CGC","","","","","","","1. Essener cobiGOLF - Club \"Blau-Gold\" e. V."]
[35571,"H","Igor","Pekrul","MGC putter Künzell","","","","","","","Minigolfclub putter Künzell 1970 e. V."]
[36243,"D","Tanja","Pekrul","MGC putter Künzell","","","","","","","Minigolfclub putter Künzell 1970 e. V."]
[67758,"D","Ann-Kathrin","Penk","BGC Oberhausen","","","","","","","Bahnengolf-Club Oberhausen e. V."]
[37558,"H","Daniel","Peppler","Reinickendorfer MGC","","","","","","","Reinickendorfer Miniatur - Golfsport - Club e. V."]
[27520,"Sm 2","Peter","Perle","MGC Mannheim","","","","","","","1. Miniatur-Golf-Club Mannheim 1968 e. V."]
[40366,"Sm 1","Klaus","Perlich","OMGC Imgolstadt","","","","","","","Oberbayerische Minigolf-Club Ingolstadt e. V."]
[67633,"Sm 1","Frank","Peschel","MGC Bad Homburg","","","","","","","Minigolf-Club Bad Homburg e. V."]
[67040,"H","Tobias","Peschke","MGC Dormagen-Brechten","","","","","","","Minigolfclub Dormagen - Brechten e. V."]
[32975,"H","Philipp","Pester","SG Arheilgen","","","","","","","Sportgemeinschaft Arheilgen 1876/1945 e. V. Abteilung Bahnengolf"]
[32976,"H","Magnus","Pester","MGC putter Künzell","","","","","","","Minigolfclub putter Künzell 1970 e. V."]
[26809,"Sm 2","Manfred","Pester","TSV Pfungstadt","","","","","","","TSV Pfungstadt e. V. Abteilung Bahnengolf"]
[50128,"H","Timo","Peter","BIG Asperg","","","","","","","Bahnengolf-Interessen-Gemeinschaft Asperg e. V. 1982"]
[7607,"Sm 2","Uwe","Peter","BGC Celle","Ja","","","","","","1. Bahnen-Golf-Club Celle von 1964 e. V."]
[45445,"Sm 2","Alois","Peter","MGC Bad Waldsee","","","","","","","Minigolf-Club Bad Waldsee 1990 e. V."]
[65723,"Sm 2","Rainer","Petermann","SC Wermelskirchen","","","","","","","SC-Wermelskirchen e. V."]
[65722,"Sw 2","Dora-Gisela","Petermann","SC Wermelskirchen","","","","","","","SC-Wermelskirchen e. V."]
[66949,"H","Moritz","Peters","MGC Olympia Kiel","","","","","","","Miniaturgolfclub Olympia Kiel e. V."]
[37020,"Sm 2","Hartmut","Peters","SC Neumünster","","","","","","","Sportclub Gut Heil Neumünster von 1881 e. V. Abteilung Miniaturgolf"]
[67371,"H","Robin","Petersen","SC Dortmund","","","","","","","Sport-Club Olympia Dortmund e. V. "]
[66924,"Sm 1","Detlef","Petersen","BGC Hannover","Ja","","","","","","1. Bahnen-Golf-Club Hannover e. V."]
[67651,"D","Susanne","Petzsche",{"$f":"VLOOKUP(L2370,Kurznamen,2,0)","v":"BIG Ingelfingen"},{"$f":"IF(VLOOKUP(L2370,Kurznamen,3,0)=\"Ja\",\"Ja\",\"\")","v":""},"","","","","","Bahnengolf Interessen-Gemeinschaft Ingelfingen 2020 e. V."]
[35460,"Sw 1","Viola","Peucker","SV Gebhardshagen","Ja","","","","","","SV Glück Auf 1901 Gebhardshagen e. V. Abteilung Minigolf"]
[37241,"H","Mirko","Peuker","MGC Dormagen-Brechten","","","","","","","Minigolfclub Dormagen - Brechten e. V."]
[37242,"D","Vanessa","Peuker","MGC Dormagen-Brechten","","","","","","","Minigolfclub Dormagen - Brechten e. V."]
[43327,"Sm 2","Hans-Jürgen","Peuker","MGC Dormagen-Brechten","","","","","","","Minigolfclub Dormagen - Brechten e. V."]
[87508,"H","Manuel","Peuser","MGC Marl","","","","","","","Mini Golf Club Marl 1960 e. V."]
[17476,"Sm 2","Werner","Pfeffer","MGC Mannheim","","","","","","","1. Miniatur-Golf-Club Mannheim 1968 e. V."]
[22574,"Sm 2","Roland","Pfeffer","SV Dreieichenhain","","","","","","","Sportverein 1890 e. V. Dreieichenhain Abteilung Bahnengolf"]
[24619,"Sm 2","Lutz","Pfeffer","Kölner MC","","","","","","","Kölner Miniatur Golf Club e. V."]
[66167,"Sm 2","Reinhard","Pfeffer","MGC Georgsmarienhütte","","","","","","","Minigolf-Club Georgsmarienhütte e. V."]
[67104,"Sm 2","Norbert","Pfeifer","MGV Ansbach","","","","","","","MGV Ansbach e. V."]
[67603,"Sm 2","Ulrich","Pfeifer","MGF Waldshut","","","","","","","Minigolffreunde Waldshut 1974 e. V."]
[31259,"Sm 2","Holger","Pfeiffer","Biskirchener BGV","","","","","","","Biskirchener Bahnen-Golf-Verein e. V."]
[34951,"Sw 1","Cynthia","Pfingst","BGC Leipzig","","","","","","","1. Bahnen Golf Club Leipzig e. V."]
[30926,"Sm 1","Thomas","Pfister","ASV Pegnitz","","","","","","","Allgemeiner Sportverein Pegnitz e. V. Abteilung Minigolf"]
[12405,"Sm 2","Klaus","Pfriem","SV Gebhardshagen","Ja","","","","","","SV Glück Auf 1901 Gebhardshagen e. V. Abteilung Minigolf"]
[47213,"Sw 2","Heiderose","Pfriem","SV Gebhardshagen","Ja",20223,"","X","","X","SV Glück Auf 1901 Gebhardshagen e. V. Abteilung Minigolf"]
[36616,"Sm 2","Joachim","Pfundt","BGV Bergisch Land","","","","","","","Bahnengolf-Verein Bergisch Land 1962/63 e. V."]
[29801,"H","Simon","Philipp","MGF Hilzingen","","","","","","","Minigolffreunde Hilzingen 80 e. V."]
[66052,"Sm 1","Andreas","Philipp","VfM Berlin","","","","","","","Verein für Minigolf e. V. Berlin"]
[67024,"H","Lukas","Philippus","BSV Bad Homburg","","","","","","","Bahnengolf-Sportverein Bad Homburg v.d.H. e. V."]
[31032,"H","Thorsten","Pichol","BGV Backumer Tal","","","","","","","BGV Backumer Tal Herten e. V."]
[38272,"D","Maike","Pichol","BGV Backumer Tal","","","","","","","BGV Backumer Tal Herten e. V."]
[66184,"D","Michelle","Pichol","BGV Backumer Tal","","","","","","","BGV Backumer Tal Herten e. V."]
[67705,"Schm","Joel","Pichol","BGV Backumer Tal","","","","","","","BGV Backumer Tal Herten e. V."]
[42849,"Sm 1","Markus","Piechota","SSC Attendorn","","","","","","","Sterngolf-Sport-Club Attendorn e. V."]
[36538,"Sw 2","Rosemarie","Piechotta","Rot-Weiß Syburg","","","","","","","Rot-Weiß Syburg 1960 e. V."]
[41953,"Sm 2","Armando","Piedigaci","SC Wermelskirchen","","","","","","","SC-Wermelskirchen e. V."]
[67752,"Sm 2","Michael","Piegeler","HMC Büttgen","","","","","","","Hobbysport Miniaturgolfclub Büttgen e. V."]
[65977,"Sm 2","Werner","Piehl","MGC Bergisch Gladbach","","","","","","","Minigolf-Club Bergisch Gladbach Gierath e. V."]
[37859,"H","Sebastian","Piekorz","BGS Hardenberg","","","","","","","BGS Hardenberg-Pötter e. V."]
[43980,"H","Oliver","Pieper","MGC Traben-Trarbach","","","","","","","Minigolfclub Traben-Trarbach e. V."]
[35658,"D","Sabrina","Pieper","MGC Traben-Trarbach","","","","","","","Minigolfclub Traben-Trarbach e. V."]
[5324,"Sm 2","Ulrich","Pieper","MGC Traben-Trarbach","","","","","","","Minigolfclub Traben-Trarbach e. V."]
[66129,"Sm 1","Andreas","Pieplau","MGC Viernheim","","","","","","","MGC Millennium Viernheim e. V."]
[38267,"Sm 2","Armin","Piest","MGC Brunsbüttel","","","","","","","Miniaturgolf-Club Brunsbüttel e. V."]
[36654,"Sm 2","Harald","Pietsch","MC Gelsenkirchen","","","","","","","1. Minigolf Club Gelsenkirchen e. V."]
[38243,"Sm 2","Peter","Pilz","MGC Ingolstadt","","","","","",""," Miniaturgolf-Club Ingolstadt e. V."]
[50457,"Sm 2","Karl-Heinz","Pindor","BGV Backumer Tal","","","","","","","BGV Backumer Tal Herten e. V."]
[38279,"Sm 1","Matthias","Pipke","BGC Bochum","","","","","","","Bahnengolf-Sportclub Bochum 1978 e. V."]
[33364,"Sm 2","Wolfgang","Pirrung","KC Homburg","","","","","","","1. Kleingolf Club Homburg-Saar 1967 e. V."]
[29305,"Sm 2","Gerhard","Pischel","MGC Wolnzach","","","","","","","Miniaturgolf-Club Wolnzach e. V."]
[36237,"Sm 2","Gerhard","Pitterle","MGC Bad Feilnbach","","","","","","","Minigolfclub Bad Feilnbach e. V."]
[40567,"Sm 2","Siegfried","Pitz","CGC Grötzingen","","","","","","","COBI-GOLF-CLUB Blau-Gelb Grötzingen 1968 e. V."]
[48880,"Sm 1","Joachim","Plack","KGC Bad Urach","","","","","","","Klein-Golf-Club Bad Urach e. V."]
[36206,"H","Daniel","Platz","FZC Bliesen","","","","","","","Freizeit Club Bliesen e. V."]
[31933,"Sm 1","Stefan","Pleger","BGC Bad Nenndorf","Ja","","","","","","Bahnen-Golf-Club Bad Nenndorf e. V."]
[67136,"Sm 1","Steffen","Plep","MGC Bad Bodendorf","","","","","","","Miniaturgolfclub Bad Bodendorf e. V."]
[43572,"Sm 1","Stefan","Plieninger","BGC Landshut","","","","","","","1. Bahnengolf-Club Landshut e. V."]
[67265,"Sw 1","Andrea","Ploch","CGC Rauschenberg","","","","","","","Cobigolf-Club Rauschenberg e. V."]
[40689,"Sm 2","Hans","Ploem","MSV Bad Kreuznach","","","","","","","MSV Bad Kreuznach e. V."]
[26514,"Sw 2","Christiane","Ploem","MSV Bad Kreuznach","","","","","","","MSV Bad Kreuznach e. V."]
[10662,"Sm 2","Günther","Plötz","Tempelhofer MV","","","","","","","Tempelhofer Miniaturgolf Verein von 1965 e. V."]
[67497,"H","Marvin","Plumpe","BGV Backumer Tal","","","","","","","BGV Backumer Tal Herten e. V."]
[66693,"Sm 1","Michael","Pohler","MGC Diessen","","","","","","","Minigolf-Club Diessen e. V."]
[6076,"Sm 2","Necdet","Polat","VfL Lohbrügge","","","","","","","Verein für Leibesübungen Lohbrügge von 1892 e. V. Abteilung Bahnengolf"]
[67162,"H","Ivo-René","Polpitz","BGC Northeim","Ja","","","","","","Bahnen-Golf-Club Northeim e. V."]
[67239,"H","Jan","Pommer","BGC Hannover","Ja","","","","","","1. Bahnen-Golf-Club Hannover e. V."]
[67240,"Sw 2","Christine","Pommer","BGC Hannover","Ja","","","","","","1. Bahnen-Golf-Club Hannover e. V."]
[44073,"Sm 1","Michael","Ponellis","MSC Wesel","","","","","","","1. Minigolf-Sportclub Wesel 66 66 e. V. "]
[67535,"Sm 2","Norbert","Pönnighaus","MGC Bad Salzuflen","","","","","","","Minigolf-Club Bad Salzuflen e. V."]
[66794,"H","Ivan","Popleteev","MGC putter Künzell","","","","","","","Minigolfclub putter Künzell 1970 e. V."]
[36776,"H","Fabian","Pöppe","BGC Bochum","","","","","","","Bahnengolf-Sportclub Bochum 1978 e. V."]
[37658,"Sm 2","Alfred","Pöppe","BGC Bochum","","","","","","","Bahnengolf-Sportclub Bochum 1978 e. V."]
[36981,"Sw 2","Birgit","Pöppe",{"$f":"VLOOKUP(L2434,Kurznamen,2,0)","v":"BGC Bochum"},{"$f":"IF(VLOOKUP(L2434,Kurznamen,3,0)=\"Ja\",\"Ja\",\"\")","v":""},"","","","","","Bahnengolf-Sportclub Bochum 1978 e. V."]
[5270,"Sm 2","Heinz","Pörrer","TG Höchberg","","","","","","","Turngemeinde Höchberg von 1862 Bahnengolf e. V."]
[36696,"Sw 2","Barbara","Pörrer","OMGC Imgolstadt","","","","","","","Oberbayerische Minigolf-Club Ingolstadt e. V."]
[49243,"H","Alexander","Porsch","ASV Pegnitz","","","","","","","Allgemeiner Sportverein Pegnitz e. V. Abteilung Minigolf"]
[67496,"H","Stephan","Pöschko","BGC Bochum","","","","","","","Bahnengolf-Sportclub Bochum 1978 e. V."]
[49886,"Sm 1","Stefan","Poser","BGC Hannover","Ja",21253,"","X","","","1. Bahnen-Golf-Club Hannover e. V."]
[49887,"Sw 1","Heike","Poser","BGC Hannover","Ja","","","","","","1. Bahnen-Golf-Club Hannover e. V."]
[33993,"Sm 2","Jürgen","Praedel","MGC Wanne-Eickel","","","","","","","Minigolfclub Rot-Weiß Wanne-Eickel e. V."]
[67700,"Sw 1","Jeannette","Praxl","MGC Bad Feilnbach","","","","","","","Minigolfclub Bad Feilnbach e. V."]
[66608,"H","Lars","Prediger","BGC Celle","Ja",28759,"X","","","X","1. Bahnen-Golf-Club Celle von 1964 e. V."]
[67415,"Sm 2","Robert","Preißler","MSG Kempten","","","","","","","Minigolf-Sport-Gemeinschaft Kempten e. V."]
[37322,"H","David","Pren","MSC Wesel","","","","","","","1. Minigolf-Sportclub Wesel 66 66 e. V. "]
[67151,"Sm 2","Wolfgang","Presser","MGC Heven","","","","","","","Miniatur - Golf - Club Heven e. V."]
[66981,"Jm","Gerald","Pressmar-Danne","MC Weinheim","","","","","","","1. Miniaturgolf-Club Weinheim e. V."]
[44355,"Sw 1","Dorothea","Preuß","MGC Felderbachtal","","","","","","","Minigolf-Club-Felderbachtal 1964 e. V."]
[6767,"Sm 2","Walter","Pribuß","BGC Illertissen","","","","","","","Bahnengolfclub Illertissen e. V."]
[36550,"Sm 2","Heinz","Pribyl","MC Rheinhausen","","","","","","","1. Minigolf-Club Rheinhausen e. V."]
[66670,"Sm 1","Ulrich","Priedigkeit","BGC Uerdingen","","","","","","","Bahnengolf-Club Uerdingen e. V."]
[66671,"Sw 1","Gudrun","Priedigkeit","BGC Uerdingen","","","","","","","Bahnengolf-Club Uerdingen e. V."]
[67743,"H","Daniel","Priemer","SSC Halver","","","","","","","SSC Halver e. V."]
[66841,"D","Anne-Katrin","Prill","MGC Karlshagen","","","","","","","Minigolfclub Karlshagen e. V."]
[66529,"Sm 2","Norbert","Probost","MGC Wetzlar","","","","","","","Miniatur-Golf-Club Wetzlar e. V."]
[26092,"H","Michael","Proschko","BGC Bad Füssing","","","","","","","1. Bahnengolfclub Bad Füssing e. V."]
[66484,"Sm 2","Franz jr.","Proschko","BGC Bad Füssing","","","","","","","1. Bahnengolfclub Bad Füssing e. V."]
[35158,"H","Dominik","Prüßner","MGC Bad Salzuflen","","","","","","","Minigolf-Club Bad Salzuflen e. V."]
[10566,"Sm 2","Johann","Pscherer jun.","MSK Olching","","","","","","","Olchinger Minigolf Sport Klub e. V."]
[30634,"H","Rudolf","Pull","MGC Mainz","","","","","","","Erster Mainzer Minigolf-Club e. V. 1964"]
[67180,"Sw 1","Ly","Puschner","BIG Ingelfingen","","","","","","","Bahnengolf Interessen-Gemeinschaft Ingelfingen 2020 e. V."]
[66528,"Sm 2","Gerhard","Puschner","BIG Ingelfingen","","","","","","","Bahnengolf Interessen-Gemeinschaft Ingelfingen 2020 e. V."]
[5509,"Sw 2","Marianne","Quade","MGC Bad Salzuflen","","","","","","","Minigolf-Club Bad Salzuflen e. V."]
[44691,"Sm 1","Frank","Quandt","TSV Salzgitter","Ja",18684,"","X","","","Turn- und Sportverein Salzgitter e. V. Abteilung Bahnengolf"]
[24081,"Sm 2","Jürgen","Quandt","HMC Büttgen","","","","","","","Hobbysport Miniaturgolfclub Büttgen e. V."]
[37784,"Sm 1","Thorsten","Quantz","MGC Heringen","","","","","","","Miniatur-Golf-Club Heringen e. V."]
[22150,"Sm 2","Andreas","Quelle","BSV München","","","","","","","Bahnengolfsportverein 86 München e. V."]
[38420,"Sm 2","Martin","Quickels","MGC Wanne-Eickel","","","","","","","Minigolfclub Rot-Weiß Wanne-Eickel e. V."]
[62816,"Sm 2","Sieghardt","Quitsch","SV Lurup","","","","","","","Sportverein Lurup-Hamburg von 1923 e. V. Abteilung Bahnengolf"]
[61546,"Sw 2","Ruth","Quitsch","SV Lurup","","","","","","","Sportverein Lurup-Hamburg von 1923 e. V. Abteilung Bahnengolf"]
[32241,"H","Matthias","Raatz","MGC Bergisch Gladbach","","","","","","","Minigolf-Club Bergisch Gladbach Gierath e. V."]
[66373,"Sm 2","Dieter","Rach","MGC Paderborn","","","","","","","1. Minigolf-Club Paderborn 1980 e. V."]
[66549,"H","Florian","Rachl","MSG Kempten","","","","","","","Minigolf-Sport-Gemeinschaft Kempten e. V."]
[66551,"Sm 1","Armin","Rachl","MSG Kempten","","","","","","","Minigolf-Sport-Gemeinschaft Kempten e. V."]
[66550,"Sw 1","Conny","Rachl","MSG Kempten","","","","","","","Minigolf-Sport-Gemeinschaft Kempten e. V."]
[38625,"Sm 1","Marcus","Rade","VfB Osnabrück","","","","","","","Verein für Bahnengolf Osnabrück von 1984 e. V."]
[37281,"D","Carina","Radeck","MGF Kempten","","","","","","","Minigolf-Freunde Steinbruch Kempten e. V."]
[34051,"Sm 2","Wolfgang","Rademacher","MGC Göttingen","Ja","","","","","","1. Miniatur-Golfsport-Club 1970 Göttingen e. V."]
[37656,"Sw 2","Sonja","Radocaj","MSK Olching","","","","","","","Olchinger Minigolf Sport Klub e. V."]
[48343,"Sm 1","Mark","Radziejewski","MGC putter Künzell","","","","","","","Minigolfclub putter Künzell 1970 e. V."]
[36793,"H","Dustin","Raffler","Essener CGC","","","","","","","1. Essener cobiGOLF - Club \"Blau-Gold\" e. V."]
[10650,"Sm 2","Walther","Raffler","Essener CGC","","","","","","","1. Essener cobiGOLF - Club \"Blau-Gold\" e. V."]
[31752,"H","Timur","Rahman","MGC putter Künzell","","","","","","","Minigolfclub putter Künzell 1970 e. V."]
[4654,"Sw 2","Brunhilde","Rahmlow","SV Lurup","","","","","","","Sportverein Lurup-Hamburg von 1923 e. V. Abteilung Bahnengolf"]
[66633,"Sm 1","Wolfgang","Raimann","MGC Bergisch Gladbach","","","","","","","Minigolf-Club Bergisch Gladbach Gierath e. V."]
[27206,"D","Bianca","Raith","MGC Oberkochen","","","","","","","Miniatur-Golfclub Oberkochen 1972 e. V."]
[43192,"Sm 1","Richard","Raith","MGC Oberkochen","","","","","","","Miniatur-Golfclub Oberkochen 1972 e. V."]
[32862,"H","Tobias","Ramcke","MC Künsebeck","","","","","","","Miniaturgolf Club Tigers Künsebeck e. V."]
[37213,"H","René","Ramming","BGC Bad Berneck","","","","","","","Bahnengolf-Club e. V. Bad Berneck"]
[45764,"Sm 2","Eduard","Rankel","MGC Bad Bodendorf","","","","","","","Miniaturgolfclub Bad Bodendorf e. V."]
[37655,"Sm 2","Roland","Ranzinger","MGC Ingolstadt","","","","","",""," Miniaturgolf-Club Ingolstadt e. V."]
[44276,"Sm 2","Michael","Rapp","MGF Hammer","","","","","","","Minigolffreunde Hammer e. V."]
[36567,"H","Marcel","Raschke","BGC Diepholz","Ja",14576,"","X","","X","Bahnen-Golf-Club Diepholz e. V."]
[44728,"H","Benjamin","Raschke","BGC Bremen","Ja",18708,"","X","","X","Bahnen-Golf-Club Bremen e. V."]
[66379,"Sm 1","Jörg","Raschke","Biskirchener BGV","","","","","","","Biskirchener Bahnen-Golf-Verein e. V."]
[884,"D","Isabell","Raschke-Dejoks","BGC Diepholz","Ja",2449,"","X","","","Bahnen-Golf-Club Diepholz e. V."]
[34099,"Sm 2","Gerhard","Rassler","MGU Neviges","","","","","","","Minigolfunion Neviges-Odenthal 1968 e. V."]
[34086,"Sw 2","Claudia","Rassler",{"$f":"VLOOKUP(L2498,Kurznamen,2,0)","v":"MGU Neviges"},{"$f":"IF(VLOOKUP(L2498,Kurznamen,3,0)=\"Ja\",\"Ja\",\"\")","v":""},"","","","","","Minigolfunion Neviges-Odenthal 1968 e. V."]
[35541,"D","Yvonne","Rastetter","CGC Grötzingen","","","","","","","COBI-GOLF-CLUB Blau-Gelb Grötzingen 1968 e. V."]
[67309,"Schm","Lucas","Rastetter","CGC Grötzingen","","","","","","","COBI-GOLF-CLUB Blau-Gelb Grötzingen 1968 e. V."]
[31213,"Sm 1","Thomas","Rastetter","CGC Grötzingen","","","","","","","COBI-GOLF-CLUB Blau-Gelb Grötzingen 1968 e. V."]
[65851,"Sm 2","Robert","Rastetter","RKV Rheinstetten","","","","","","","Rad- und Kraftfahrervereins \"Solidarität\" Mörsch e. V. Abteilung Minigolf Wölfe Rheinstetten 02"]
[65824,"Sm 1","Markus","Rath","BGC Goslar","Ja",27405,"X","","","X","Bahnen-Golf-Club Goslar e. V."]
[23693,"Sm 2","Udo","Rathje","MGC Olympia Kiel","","","","","","","Miniaturgolfclub Olympia Kiel e. V."]
[51902,"Sm 1","Oliver","Rathjens","MSC Wesel","","","","","","","1. Minigolf-Sportclub Wesel 66 66 e. V. "]
[42343,"Sm 1","Josef","Rauch","MGC Ingolstadt","","","","","",""," Miniaturgolf-Club Ingolstadt e. V."]
[42585,"Sm 1","Martin","Rausch","MGC putter Künzell","","","","","","","Minigolfclub putter Künzell 1970 e. V."]
[47353,"Sm 2","Joachim","Rautenberg","MGC Heven","","","","","","","Miniatur - Golf - Club Heven e. V."]
[66721,"Sm 1","Stefan","Rebstock","MC Elmshorn","","","","","","","Minigolf-Club Flora Elmshorn e. V."]
[37325,"Sm 1","Jens","Rechenmacher","VfB Osnabrück","","","","","","","Verein für Bahnengolf Osnabrück von 1984 e. V."]
[36015,"D","Kerstin","Reder","TSV Kücknitz","","","","","","","Turn - und Sportverein Kücknitz von 1911 e. V. Abteilung Bahnengolf"]
[37501,"Sw 1","Maike","Reese","MGC Felderbachtal","","","","","","","Minigolf-Club-Felderbachtal 1964 e. V."]
[67703,"Sw 2","Hannelore","Reher","VfL Lohbrügge","","","","","","","Verein für Leibesübungen Lohbrügge von 1892 e. V. Abteilung Bahnengolf"]
[43640,"Sm 2","Norbert","Rehfeld","BGV Bergisch Land","","","","","","","Bahnengolf-Verein Bergisch Land 1962/63 e. V."]
[34994,"Sw 1","Sabine","Rehse","BGC Bochum","","","","","","","Bahnengolf-Sportclub Bochum 1978 e. V."]
[32470,"H","Matthias","Reiche","BGC Leipzig","","","","","","","1. Bahnen Golf Club Leipzig e. V."]
[34731,"Sm 2","Michael","Reichert","MGC Unterschneidheim","","","","","","","Minigolfclub Unterschneidheim e. V."]
[40054,"Sm 2","Thomas","Reichert","TV Niederstetten","","","","","","","Turnverein Niederstetten 1862 e. V. Abteilung Minigolf"]
[26125,"H","Matthias","Reichle","BSV Inzlingen","","","","","","","Bahnengolf-Sportverein Inzlingen 1979 e. V."]
[43382,"H","Stefan","Reichle","BSV Inzlingen","","","","","","","Bahnengolf-Sportverein Inzlingen 1979 e. V."]
[67023,"Schm","Ben","Reichle","BSV Inzlingen","","","","","","","Bahnengolf-Sportverein Inzlingen 1979 e. V."]
[42375,"Sm 1","Dirk","Reichle","MGC Ladenburg","","","","","","","1. Miniaturgolf-Club Ladenburg e. V."]
[3975,"Sm 2","Urs","Reichle","BSV Inzlingen","","","","","","","Bahnengolf-Sportverein Inzlingen 1979 e. V."]
[32876,"Sw 2","Heidi","Reichle","BSV Inzlingen","","","","","","","Bahnengolf-Sportverein Inzlingen 1979 e. V."]
[67490,"Sm 1","Sascha","Reiff","MGC Bamberg","","","","","","","1. Minigolfclub Bamberg e. V."]
[67550,"Jm","Leon","Reim","MGC Wetzlar","","","","","","","Miniatur-Golf-Club Wetzlar e. V."]
[18172,"Sm 2","Werner","Reimer","VfM Bottrop","","","","","","","Verein für Minigolf Bottrop e. V."]
[40617,"Sm 1","Franz","Reimling","MC Ilvesheim","","","","","","","Miniaturgolf-Club Ilvesheim e. V."]
[49312,"H","Andy","Rein","MGC Ludwigshafen","","","","","","","1. Miniatur-Golf-Club Ludwigshafen 1964 e. V."]
[66993,"Jw","Leonie","Rein","MGC Ludwigshafen","","","","","","","1. Miniatur-Golf-Club Ludwigshafen 1964 e. V."]
[6215,"Sm 2","Franz-Josef","Reinartz","KGC Mönchengladbach","","","","","","","1. Klein-Golf-Club Mönchengladbach e. V."]
[32387,"H","Tobias","Reinhardt","MSC Herscheid","","","","","","","Minigolf-Sportclub Herscheid 1963 e. V."]
[67337,"H","André","Reinhardt","MGC Ostheim/Rhön","","","","","","","Miniaturgolfclub Ostheim/Rhön e. V. "]
[67666,"H","Oliver","Reinhardt","Hamburger MC","","","","","","","Hamburger Minigolf Club von 1965 e. V."]
[36966,"Sm 1","Günther","Reinhardt","Essener CGC","","","","","","","1. Essener cobiGOLF - Club \"Blau-Gold\" e. V."]
[6838,"Sm 2","Manfred","Reinhardt","BGC Heilbronn","","","","","","","Bahnengolf Club Heilbronn e. V."]
[42690,"Sm 2","Michael","Reinicke","MC Möve Cuxhaven","Ja",17596,"","X","","X","Miniaturgolf-Club \"Möve\" Cuxhaven-Sahlenburg e. V."]
[42691,"Sm 2","Frank","Reinicke","MC Möve Cuxhaven","Ja",17597,"","X","","X","Miniaturgolf-Club \"Möve\" Cuxhaven-Sahlenburg e. V."]
[44862,"Sw 2","Andrea","Reinicke","MC Möve Cuxhaven","Ja",18799,"","X","","X","Miniaturgolf-Club \"Möve\" Cuxhaven-Sahlenburg e. V."]
[49802,"D","Corina","Reinisch","BGC Neutraubling","","","","","","","Bahnengolf-Club Neutraubling e. V."]
[63580,"Jm","Tim","Reinisch","BGC Neutraubling","","","","","","","Bahnengolf-Club Neutraubling e. V."]
[64926,"Schm","Klaus jr.","Reinisch","BGC Neutraubling","","","","","","","Bahnengolf-Club Neutraubling e. V."]
[43664,"Sm 1","Roman","Reinisch","BGC Neutraubling","","","","","","","Bahnengolf-Club Neutraubling e. V."]
[4065,"Sm 2","Klaus","Reinisch","BGC Neutraubling","","","","","","","Bahnengolf-Club Neutraubling e. V."]
[4076,"Sw 2","Hildegard","Reinisch","BGC Neutraubling","","","","","","","Bahnengolf-Club Neutraubling e. V."]
[50558,"Sm 2","Jürgen","Reinshagen","MGC Bergisch Gladbach","","","","","","","Minigolf-Club Bergisch Gladbach Gierath e. V."]
[48965,"D","Sandra","Reis","MGC Wertheim","","","","","","","Minigolfdub Wertheim ´91 e. V."]
[45515,"Sm 2","Hans","Reisdorff","MGC Bad Bodendorf","","","","","","","Miniaturgolfclub Bad Bodendorf e. V."]
[4138,"Sw 2","Anneliese","Reisdorff","MGC Bad Bodendorf","","","","","","","Miniaturgolfclub Bad Bodendorf e. V."]
[48140,"H","Alexander","Reiss","BGC Illertissen","","","","","","","Bahnengolfclub Illertissen e. V."]
[48968,"Sm 1","Wolfgang","Reiss","NMC Kelheim","","","","","","","1. Niederbayerischer Minigolf-Club Kelheim e. V."]
[33172,"D","Maria-Ina","Reißmann","MGV Eibenstock","","","","","","","Miniaturgolfverein Eibenstock 1997 e. V.\t"]
[32817,"Sm 2","Volkmar","Reißmann","MGV Eibenstock","","","","","","","Miniaturgolfverein Eibenstock 1997 e. V.\t"]
[66612,"D","Lea","Reitemeier","MGC Wanne-Eickel","","","","","","","Minigolfclub Rot-Weiß Wanne-Eickel e. V."]
[66613,"Sm 2","Michael","Reitemeier","MGC Wanne-Eickel","","","","","","","Minigolfclub Rot-Weiß Wanne-Eickel e. V."]
[45574,"Sm 1","Josef","Reiter","MGF Hammer","","","","","","","Minigolffreunde Hammer e. V."]
[51479,"Sm 1","Thomas","Remscheidt","SSC Attendorn","","","","","","","Sterngolf-Sport-Club Attendorn e. V."]
[66850,"Sm 2","Uwe","Rennert","TSV Flöha","","","","","","","Turn- und Sportverein Flöha 1848 e. V. Abteilung Minigolf"]
[46579,"Sm 1","Manfred","Retzlaff","BIG Asperg","","","","","","","Bahnengolf-Interessen-Gemeinschaft Asperg e. V. 1982"]
[46595,"Sw 1","Brigitte","Retzlaff","BIG Asperg","","","","","","","Bahnengolf-Interessen-Gemeinschaft Asperg e. V. 1982"]
[37449,"Sw 2","Brigitte","Reul","BSV Bad Homburg","","","","","","","Bahnengolf-Sportverein Bad Homburg v.d.H. e. V."]
[66656,"Sm 1","Michel","Rhyn",{"$f":"VLOOKUP(L2562,Kurznamen,2,0)","v":"SG Arheilgen"},{"$f":"IF(VLOOKUP(L2562,Kurznamen,3,0)=\"Ja\",\"Ja\",\"\")","v":""},"","","","","","Sportgemeinschaft Arheilgen 1876/1945 e. V. Abteilung Bahnengolf"]
[34628,"H","Ilario","Ricci","BGC Wolfsburg","Ja","","","","","","1. Bahnen - Golf - Club Wolfsburg e. V."]
[27886,"Sm 1","Andreas","Richard","MGC Süßen","","","","","","","1. Miniaturgolfclub Süßen e. V."]
[34904,"H","Mike","Richter","MGV Eibenstock","","","","","","","Miniaturgolfverein Eibenstock 1997 e. V.\t"]
[65809,"H","Tobias","Richter","MC Weinheim","","","","","","","1. Miniaturgolf-Club Weinheim e. V."]
[67635,"D","Sabine","Richter","BGC Leipzig","","","","","","","1. Bahnen Golf Club Leipzig e. V."]
[31089,"Sw 1","Anja","Richter","BGC Uerdingen","","","","","","","Bahnengolf-Club Uerdingen e. V."]
[47480,"Sm 2","Siegfried","Richter","KGC Mönchengladbach","","","","","","","1. Klein-Golf-Club Mönchengladbach e. V."]
[3149,"Sw 2","Helga","Riebeling","MC Weinheim","","","","","","","1. Miniaturgolf-Club Weinheim e. V."]
[31071,"Sw 1","Pia","Riebesam","HMC Büttgen","","","","","","","Hobbysport Miniaturgolfclub Büttgen e. V."]
[43517,"Sm 1","Mirko","Riecken","MC Elmshorn","","","","","","","Minigolf-Club Flora Elmshorn e. V."]
[43372,"Sm 1","Ralf","Riedel","MGC Tuttlingen","","","","","","","Erster Minigolf - Club Tuttlingen e. V."]
[43376,"Sm 1","Kurt","Riedel","MGC Tuttlingen","","","","","","","Erster Minigolf - Club Tuttlingen e. V."]
[43350,"Sm 2","Wolfgang","Rieder","MGF Waldshut","","","","","","","Minigolffreunde Waldshut 1974 e. V."]
[43435,"Sw 2","Elisabeth","Riedl","FMGC Lichtenfels","","","","","","","1. Fränkischer Minigolfclub Lichtenfels 1961 e. V."]
[66700,"H","Niklas","Riedlinger","MGC Hechingen","","","","","","","1. Minigolfclub Hechingen e. V."]
[34059,"Sm 1","Ulf","Rieger","BGS Hardenberg","","","","","","","BGS Hardenberg-Pötter e. V."]
[66239,"Sm 1","Erik","Rieger","MGC Bad Soden","","","","","","","Miniaturgolfclub Bad Soden-Salmünster e. V."]
[67519,"H","Mike","Riehl","MGC Mainz","","","","","","","Erster Mainzer Minigolf-Club e. V. 1964"]
[67518,"D","Susanne","Riehl","MGC Mainz","","","","","","","Erster Mainzer Minigolf-Club e. V. 1964"]
[31344,"Sm 1","Markus","Rieker","MGC Tuttlingen","","","","","","","Erster Minigolf - Club Tuttlingen e. V."]
[30817,"Sm 1","Michael","Riemann","CGC Rauschenberg","","","","","","","Cobigolf-Club Rauschenberg e. V."]
[41463,"Sm 1","Carsten","Riemann","MGC Göttingen","Ja","","","","","","1. Miniatur-Golfsport-Club 1970 Göttingen e. V."]
[42684,"Sw 1","Susanne","Riemann","MGC Kassel","Ja","","","","","","1. Mini-Golfsport-Club Kassel-Vellmar 1964 e. V."]
[66494,"Sm 2","Lothar","Riemann","MGC Bad Salzuflen","","","","","","","Minigolf-Club Bad Salzuflen e. V."]
[66493,"Sw 2","Karin","Riemann","MGC Bad Salzuflen","","","","","","","Minigolf-Club Bad Salzuflen e. V."]
[36048,"Sm 2","Klaus","Riepe","MGC Harrislee","","","","","","","Sportverein Minigolfclub Harrislee-Wassersleben e. V."]
[67672,"D","Kerlyn","Ries","FMGC Lichtenfels","","","","","","","1. Fränkischer Minigolfclub Lichtenfels 1961 e. V."]
[6783,"Sm 2","Karl-Ludwig","Ries","MSV Bad Kreuznach","","","","","","","MSV Bad Kreuznach e. V."]
[33348,"Sw 2","Anke","Riesbeck","Preetzer TSV","","","","","","","Preetzer Turn- und Sportverein von 1861 e. V. Abteilung Minigolf"]
[42608,"Sm 2","Ulrich","Riesenbeck","KGC Mönchengladbach","","","","","","","1. Klein-Golf-Club Mönchengladbach e. V."]
[66619,"H","Ole","Riewe","TG Höchberg","","","","","","","Turngemeinde Höchberg von 1862 Bahnengolf e. V."]
[37236,"Sm 2","Karl","Ring","MGC Unterschneidheim","","","","","","","Minigolfclub Unterschneidheim e. V."]
[42965,"Sm 2","Norbert","Ring","HMC Büttgen","","","","","","","Hobbysport Miniaturgolfclub Büttgen e. V."]
[38262,"Sw 1","Angelika Pia","Ringler","MGC Tuttlingen","","","","","","","Erster Minigolf - Club Tuttlingen e. V."]
[31221,"H","Andreas","Ringshandl","NMC Kelheim","","","","","","","1. Niederbayerischer Minigolf-Club Kelheim e. V."]
[67713,"H","Björn","Rink","MSF Brilon","","","","","","","Minigolfsportfreunde Brilon e. V."]
[48112,"Sm 2","Walter","Rinke","MC Elmshorn","","","","","","","Minigolf-Club Flora Elmshorn e. V."]
[66410,"H","Lukas","Rinker","MGC Wetzlar","","","","","","","Miniatur-Golf-Club Wetzlar e. V."]
[37586,"H","Joshua","Rischar","BGC Bildstock","","","","","","","Bahnen-Golf-Club Bildstock e. V."]
[65974,"Sm 1","Oliver","Rissling","MGC Bergisch Gladbach","","","","","","","Minigolf-Club Bergisch Gladbach Gierath e. V."]
[38371,"Sm 2","Wolfgang","Ristow","MGC Paderborn","","","","","","","1. Minigolf-Club Paderborn 1980 e. V."]
[33975,"H","Michael","Ritschel","MC Schriesheim","","","","","","","Miniaturgolf Sportclub Schriesheim e. V."]
[5020,"Sm 2","Reiner","Ritschel","MC Schriesheim","","","","","","","Miniaturgolf Sportclub Schriesheim e. V."]
[38544,"Sm 2","Klaus","Ritschel","MGC Bad Bocklet","","","","","","","Miniatur-Golf-Club \"Stahlquelle\", Bad Bocklet 1989 e. V."]
[36284,"Sw 1","Claudia","Ritschmann","BGC Heilbronn","","","","","","","Bahnengolf Club Heilbronn e. V."]
[36285,"Sm 2","Uwe","Ritschmann","BGC Heilbronn","","","","","","","Bahnengolf Club Heilbronn e. V."]
[66773,"Sm 1","Sascha","Ritterbusch","MGC Lohfelden","Ja","","","","","","1. Miniatur-Golfsport-Club Lohfelden e. V."]
[44193,"Sm 1","Thorsten","Ritz","BGSC Gladbeck","","","","","","","Bahnengolfsportclub \"Gut Schlag\" Gladbeck e. V."]
[43368,"Sm 1","Andreas","Ritzert","MC Ilvesheim","","","","","","","Miniaturgolf-Club Ilvesheim e. V."]
[42533,"Sw 1","Bettina","Ritzert","MC Ilvesheim","","","","","","","Miniaturgolf-Club Ilvesheim e. V."]
[33395,"Sw 2","Eva","Rochel","SGC Hagen","","","","","","","Sterngolf-Club Hagen e. V."]
[66915,"Sm 2","Jens","Rockstroh","TSV Flöha","","","","","","","Turn- und Sportverein Flöha 1848 e. V. Abteilung Minigolf"]
[66037,"Sm 1","Andreas","Rödig","MGC Bad Feilnbach","","","","","","","Minigolfclub Bad Feilnbach e. V."]
[19330,"Sm 2","Peter","Rödiger","MGC Wetzlar","","","","","","","Miniatur-Golf-Club Wetzlar e. V."]
[34792,"H","Timo","Roessler","MGC Metzingen","","","","","","","1. Miniaturgolf Club Metzingen e. V."]
[66856,"Sm 2","Heinz-Friedrich","Rogall","MGC Felderbachtal","","","","","","","Minigolf-Club-Felderbachtal 1964 e. V."]
[37470,"Sm 1","Thomas","Rogge","VfM Berlin","","","","","","","Verein für Minigolf e. V. Berlin"]
[66697,"Sm 1","Jens","Rogler","MGC Karlshagen","","","","","","","Minigolfclub Karlshagen e. V."]
[43860,"Sm 2","Uwe","Rohard","MGC Brunsbüttel","","","","","","","Miniaturgolf-Club Brunsbüttel e. V."]
[36873,"H","Dennis","Rohde","TSV Kücknitz","","","","","","","Turn - und Sportverein Kücknitz von 1911 e. V. Abteilung Bahnengolf"]
[67110,"Sw 1","Sabine","Röhrl","MSK Olching","","","","","","","Olchinger Minigolf Sport Klub e. V."]
[67628,"Schm","Tom-Luca","Röhsa","Hamburger MC","","","","","","","Hamburger Minigolf Club von 1965 e. V."]
[67746,"Sm 1","Kay","Röhsa","Hamburger MC","","","","","","","Hamburger Minigolf Club von 1965 e. V."]
[67310,"Sm 2","Peter","Roland",{"$f":"VLOOKUP(L2626,Kurznamen,2,0)","v":"MC Möve Cuxhaven"},{"$f":"IF(VLOOKUP(L2626,Kurznamen,3,0)=\"Ja\",\"Ja\",\"\")","v":"Ja"},"","","","","","Miniaturgolf-Club \"Möve\" Cuxhaven-Sahlenburg e. V."]
[19228,"Sm 2","Karlheinz","Roller","MGC Metzingen","","","","","","","1. Miniaturgolf Club Metzingen e. V."]
[42632,"Sm 1","Joachim","Romano","BGC Bad Füssing","","","","","","","1. Bahnengolfclub Bad Füssing e. V."]
[44981,"Sm 1","Michael","Romberg","MGC Biebertal","","","","","","","Miniatur-Golf-Club Freizeitzentrum Biebertal e. V."]
[34766,"Sw 1","Yvonne","Romberg","MGC Biebertal","","","","","","","Miniatur-Golf-Club Freizeitzentrum Biebertal e. V."]
[6616,"Sm 2","Wolfgang","Romberg","BGC Paffendorf","","","","","","","Bahnengolf Club Schloß Paffendorf e. V."]
[25686,"Sw 2","Silvia","Romberg","BGC Paffendorf","","","","","","","Bahnengolf Club Schloß Paffendorf e. V."]
[37427,"Sm 1","Stephan","Römer","KGC Mönchengladbach","","","","","","","1. Klein-Golf-Club Mönchengladbach e. V."]
[16911,"H","Wolfgang","Romero Bustillo","MSC Bad Godesberg","","","","","","","Minigolf-Sport-Club Bad Godesberg e. V."]
[67431,"H","Cedric","Rörig","SSC Attendorn","","","","","","","Sterngolf-Sport-Club Attendorn e. V."]
[24416,"Sm 2","Martin","Rösch","NMC Kelheim","","","","","","","1. Niederbayerischer Minigolf-Club Kelheim e. V."]
[38635,"H","Benjamin","Rose","BGC Dormagen","","","","","","","Bahnengolf-Club Dormagen e. V."]
[65915,"Sm 2","Karl-Wilhelm","Rose","BGC Dormagen","","","","","","","Bahnengolf-Club Dormagen e. V."]
[38636,"Sw 2","Heidemarie","Rose","BGC Dormagen","","","","","","","Bahnengolf-Club Dormagen e. V."]
[35849,"H","Christian","Roselieb","Bochumer MC","","","","","","","Bochumer Minigolf-Club 1960 e. V."]
[35850,"Sm 2","Manfred","Roselieb","MGC Göttingen","Ja",13949,"X","","","","1. Miniatur-Golfsport-Club 1970 Göttingen e. V."]
[35560,"Sm 1","Axel","Rosemann","MGU Neviges","","","","","","","Minigolfunion Neviges-Odenthal 1968 e. V."]
[33650,"D","Marina","Rosenbach","MGC Traben-Trarbach","","","","","","","Minigolfclub Traben-Trarbach e. V."]
[66634,"Sm 2","Willi","Rosenberger","MGC Würzburg","","","","","","","Miniaturgolfsportverein Würzburg - Löwenbrücke e. V."]
[29032,"Sm 1","Detlev","Rösener","MSK Neheim-Hüsten","","","","","","","MINIGOLF-SPORT-KLUB Neheim-Hüsten e. V."]
[3522,"Sw 2","Ingeborg","Rosenkranz","OMGC Imgolstadt","","","","","","","Oberbayerische Minigolf-Club Ingolstadt e. V."]
[36949,"Sm 2","Roland","Rösner","MGC Bad Feilnbach","","","","","","","Minigolfclub Bad Feilnbach e. V."]
[31044,"H","Markus","Roßmeier","BGC Bad Füssing","","","","","","","1. Bahnengolfclub Bad Füssing e. V."]
[67414,"H","Stefan","Rotenstein","MGC Peine","Ja","","","","","","1. Miniaturgolf-Club Peine von 1965 e. V."]
[66952,"Jw","Marie Sophie","Rotermund","BGC Celle","Ja","","","","","","1. Bahnen-Golf-Club Celle von 1964 e. V."]
[38248,"Sm 2","Jürgen","Rotermund","BGC Celle","Ja","","","","","","1. Bahnen-Golf-Club Celle von 1964 e. V."]
[66992,"H","Frank","Roth","BGV Rodalben","","","","","","","1. Bahnengolfverein Rodalben 1977 e. V."]
[37019,"D","Nathalie-Inez","Roth","TG Höchberg","","","","","","","Turngemeinde Höchberg von 1862 Bahnengolf e. V."]
[34054,"Sm 2","Dieter","Rothermel","MSC Bensheim-Auerbach","","","","","","","Minigolf-Sport-Club Bensheim-Auerbach e. V."]
[34053,"Sw 2","Ute","Rothermel","MSC Bensheim-Auerbach","","","","","","","Minigolf-Sport-Club Bensheim-Auerbach e. V."]
[87506,"D","Sandra","Röttger","MGC Göttingen","Ja","","","","","","1. Miniatur-Golfsport-Club 1970 Göttingen e. V."]
[67586,"Sm 1","Stefan","Ruber","MGC Bad Feilnbach","","","","","","","Minigolfclub Bad Feilnbach e. V."]
[66908,"H","Sebastian","Rübner","MGC Bad Bocklet","","","","","","","Miniatur-Golf-Club \"Stahlquelle\", Bad Bocklet 1989 e. V."]
[66803,"Sm 1","Dietmar","Ruck","BGC Schweinfurt","","","","","","","Bahnengolfclub Schweinfurt e. V."]
[67608,"Sm 2","Peter","Ruck","MGV Ansbach","","","","","","","MGV Ansbach e. V."]
[27788,"H","Sven","Rücker","MGC Wetzlar","","","","","","","Miniatur-Golf-Club Wetzlar e. V."]
[66287,"D","Verena","Rude","MGC Ladenburg","","","","","","","1. Miniaturgolf-Club Ladenburg e. V."]
[24182,"Sm 2","Dieter","Rude","MGC Ladenburg","","","","","","","1. Miniaturgolf-Club Ladenburg e. V."]
[67597,"Sm 1","Holger","Rüdebusch","SV Lurup","","","","","","","Sportverein Lurup-Hamburg von 1923 e. V. Abteilung Bahnengolf"]
[36630,"Sm 2","Hans","Ruder","RKV Rheinstetten","","","","","","","Rad- und Kraftfahrervereins \"Solidarität\" Mörsch e. V. Abteilung Minigolf Wölfe Rheinstetten 02"]
[42717,"Sm 1","Thomas","Ruff","MGC Ravensburg","","","","","","","MGC Ravensburg-Weingarten e. V."]
[51306,"Sm 1","Wolfgang","Ruft","BGC Hannover","Ja","","","","","","1. Bahnen-Golf-Club Hannover e. V."]
[67784,"Sm 1","Frank","Rüger","MGV Ansbach","","","","","","","MGV Ansbach e. V."]
[21226,"Sm 2","Dieter","Rüger","MSC Wesel","","","","","","","1. Minigolf-Sportclub Wesel 66 66 e. V. "]
[22305,"Sm 2","Klaus","Rüger","BGC Northeim","Ja","","","","","","Bahnen-Golf-Club Northeim e. V."]
[36047,"Sm 2","Karl-Heinz","Rühle","MGC Wolnzach","","","","","","","Miniaturgolf-Club Wolnzach e. V."]
[37637,"D","Anna","Rümmelin","BSV Inzlingen","","","","","","","Bahnengolf-Sportverein Inzlingen 1979 e. V."]
[67225,"Sw 1","Eycke","Rümmelin","BSV Inzlingen","","","","","","","Bahnengolf-Sportverein Inzlingen 1979 e. V."]
[49432,"H","Jürgen","Rupp","MGC Ravensburg","","","","","","","MGC Ravensburg-Weingarten e. V."]
[66956,"Sw 2","Petra","Rupp","MGC Mainz","","","","","","","Erster Mainzer Minigolf-Club e. V. 1964"]
[6727,"Sm 2","Eberhard","Rüppel","MGC Bad Homburg","","","","","","","Minigolf-Club Bad Homburg e. V."]
[29657,"Sm 1","Frank","Rüter","MSK Neheim-Hüsten","","","","","","","MINIGOLF-SPORT-KLUB Neheim-Hüsten e. V."]
[65913,"Sm 2","Holger","Ruzicka","BGC Illertissen","","","","","","","Bahnengolfclub Illertissen e. V."]
[36288,"H","Patrick","Saar","MGC Tuttlingen","","","","","","","Erster Minigolf - Club Tuttlingen e. V."]
[31240,"Sw 1","Petra","Sabath","MGC Einbeck","Ja","","","","","","Miniatur-Golf-Club Einbeck e. V."]
[43142,"Sm 2","Wolfgang","Sachs","MGC Bad Salzuflen","","","","","","","Minigolf-Club Bad Salzuflen e. V."]
[67074,"H","Torsten","Sachse","SG Arheilgen","","","","","","","Sportgemeinschaft Arheilgen 1876/1945 e. V. Abteilung Bahnengolf"]
[29035,"Sm 1","Markus","Sack","MSK Neheim-Hüsten","","","","","","","MINIGOLF-SPORT-KLUB Neheim-Hüsten e. V."]
[28574,"Sm 1","Bernd","Sadzeck","MSC Neu-Wulstorf","","","","","","","1. Minigolf-Sport-Club Hamburg-Neu-Wulmstorf e. V."]
[66088,"D","Ellen","Saft","MSK Olching","","","","","","","Olchinger Minigolf Sport Klub e. V."]
[66089,"D","Chiana","Saft","MSK Olching","","","","","","","Olchinger Minigolf Sport Klub e. V."]
[67737,"Sm 2","Dirk","Sagowsky","MGC Bergisch Gladbach","","","","","","","Minigolf-Club Bergisch Gladbach Gierath e. V."]
[66320,"Sw 1","Petra","Sakulski","SSC Attendorn","","","","","","","Sterngolf-Sport-Club Attendorn e. V."]
[45743,"Sm 1","Henri","Salewski","Bochumer MC","","","","","","","Bochumer Minigolf-Club 1960 e. V."]
[67474,"Sm 1","Andreas","Salitz",{"$f":"VLOOKUP(L2690,Kurznamen,2,0)","v":"Essener CGC"},{"$f":"IF(VLOOKUP(L2690,Kurznamen,3,0)=\"Ja\",\"Ja\",\"\")","v":""},"","","","","","1. Essener cobiGOLF - Club \"Blau-Gold\" e. V."]
[33791,"Sm 2","Reiner","Salzmann","MSC Bad Godesberg","","","","","","","Minigolf-Sport-Club Bad Godesberg e. V."]
[29061,"H","Mark","Sandkamp","MGC Epe","","","","","","","1. Minigolfclub Epe 1978 e. V."]
[67727,"Schm","Tristan","Sänger","BSV Ohlsbach","","","","","","","Bahnengolfsportverein 82 Ohlsbach e. V."]
[33349,"Sm 1","Ralph","Santen","Preetzer TSV","","","","","","","Preetzer Turn- und Sportverein von 1861 e. V. Abteilung Minigolf"]
[66760,"Sm 1","Turan","Sariefe","MGC Ingolstadt","","","","","",""," Miniaturgolf-Club Ingolstadt e. V."]
[6664,"Sm 2","Manfred","Sassenberg","MGC Mainz","","","","","","","Erster Mainzer Minigolf-Club e. V. 1964"]
[66120,"H","Michael","Sattler","BSV Bad Homburg","","","","","","","Bahnengolf-Sportverein Bad Homburg v.d.H. e. V."]
[29845,"Sm 1","Albert","Sauer","BSV Ohlsbach","","","","","","","Bahnengolfsportverein 82 Ohlsbach e. V."]
[49737,"H","Kay","Sauerland","MGC Harrislee","","","","","","","Sportverein Minigolfclub Harrislee-Wassersleben e. V."]
[67475,"Sw 2","Gabriela","Sawärt","BGC Bochum","","","","","","","Bahnengolf-Sportclub Bochum 1978 e. V."]
[43149,"Sm 1","Ralf","Sawartowski","MGC Wanne-Eickel","","","","","","","Minigolfclub Rot-Weiß Wanne-Eickel e. V."]
[65989,"H","Sadettin","Saykin","MGC Bad Soden","","","","","","","Miniaturgolfclub Bad Soden-Salmünster e. V."]
[65984,"Sm 1","Sadiddin","Saykin","MGC Bad Soden","","","","","","","Miniaturgolfclub Bad Soden-Salmünster e. V."]
[30667,"Sm 1","Jens","Schacht","Hamburger MC","","","","","","","Hamburger Minigolf Club von 1965 e. V."]
[40098,"Sw 2","Monika","Schacht","MGC Harrislee","","","","","","","Sportverein Minigolfclub Harrislee-Wassersleben e. V."]
[67049,"Sm 1","Frank","Schachtsiek","Bochumer MC","","","","","","","Bochumer Minigolf-Club 1960 e. V."]
[12064,"Sm 2","Egon","Schacke","VfM Berlin","","","","","","","Verein für Minigolf e. V. Berlin"]
[36767,"Sw 2","Doris","Schacke","VfM Berlin","","","","","","","Verein für Minigolf e. V. Berlin"]
[44021,"Sm 1","Michael","Schaefer","MSC Bad Godesberg","","","","","","","Minigolf-Sport-Club Bad Godesberg e. V."]
[31511,"H","Willi","Schäfer","MSF Brilon","","","","","","","Minigolfsportfreunde Brilon e. V."]
[37818,"H","Pascal","Schäfer","MGC Traben-Trarbach","","","","","","","Minigolfclub Traben-Trarbach e. V."]
[66150,"H","Dennis","Schäfer","MSC Bensheim-Auerbach","","","","","","","Minigolf-Sport-Club Bensheim-Auerbach e. V."]
[67729,"D","Celine","Schäfer","SV Dreieichenhain","","","","","","","Sportverein 1890 e. V. Dreieichenhain Abteilung Bahnengolf"]
[1814,"Sm 2","Norbert","Schäfer","MGC Kassel","Ja","","","","","","1. Mini-Golfsport-Club Kassel-Vellmar 1964 e. V."]
[24462,"Sm 2","Jürgen","Schäfer","MGC Wanne-Eickel","","","","","","","Minigolfclub Rot-Weiß Wanne-Eickel e. V."]
[27438,"Sm 2","Armin","Schäfer","MSC Herscheid","","","","","","","Minigolf-Sportclub Herscheid 1963 e. V."]
[49087,"Sm 2","Richard","Schäfer","MGC Mainz","","","","","","","Erster Mainzer Minigolf-Club e. V. 1964"]
[45844,"Sm 1","Carsten","Schakowski","MGC Monrepos","","","","","","","Minigolfclub Monrepos e. V."]
[26089,"Sm 2","Albert","Schamberger","MSK Olching","","","","","","","Olchinger Minigolf Sport Klub e. V."]
[26088,"Sw 2","Gerda","Schamberger","MSK Olching","","","","","","","Olchinger Minigolf Sport Klub e. V."]
[66787,"Sm 1","Sven","Schäning","SV Gebhardshagen","Ja","","","","","","SV Glück Auf 1901 Gebhardshagen e. V. Abteilung Minigolf"]
[67243,"Sw 1","Petra","Schäning","SV Gebhardshagen","Ja","","","","","","SV Glück Auf 1901 Gebhardshagen e. V. Abteilung Minigolf"]
[6642,"Sm 2","Erich","Schankweiler","BGC Celle","Ja","","","","","","1. Bahnen-Golf-Club Celle von 1964 e. V."]
[46517,"Sm 1","Thomas","Schäpe","BGSV Kerpen","","","","","","","Bahnen-Golf-Sport-Vereinigung Kerpen e. V."]
[67544,"Sm 2","Richard","Scharf","BGC Illertissen","","","","","","","Bahnengolfclub Illertissen e. V."]
[7907,"Sm 2","Peter","Scharfenberg","MSC Bad Godesberg","","","","","","","Minigolf-Sport-Club Bad Godesberg e. V."]
[38455,"Sw 1","Helga","Scharnhorst","BGC Hannover","Ja",26907,"X","","","","1. Bahnen-Golf-Club Hannover e. V."]
[1549,"Sm 2","Rüdiger","Scharnhorst","BGC Hannover","Ja",3113,"X","","","","1. Bahnen-Golf-Club Hannover e. V."]
[67147,"Sw 1","Sabine","Scharpe","BSC Ennepetal","","","","","","","Bahngolf-Sport-Club Ennepetal e. V."]
[27121,"Sm 2","Arno","Schatke","BGC Northeim","Ja",8146,"X","","","","Bahnen-Golf-Club Northeim e. V."]
[34453,"Sm 2","Michael","Schätz","MGC Mannheim","","","","","","","1. Miniatur-Golf-Club Mannheim 1968 e. V."]
[67762,"Sm 1","Peter","Schätzle","MGC Bad Homburg","","","","","","","Minigolf-Club Bad Homburg e. V."]
[35464,"D","Susanne","Schaub","MGC Würzburg","","","","","","","Miniaturgolfsportverein Würzburg - Löwenbrücke e. V."]
[66477,"Jm","Karim","Schaub","MGC Würzburg","","","","","","","Miniaturgolfsportverein Würzburg - Löwenbrücke e. V."]
[87515,"H","Julian","Schauer","PTSV Hof","","","","","","","Post- und Telekom-Sportverein Hof e. V. Abteilung Minigolf "]
[40975,"Sm 1","Werner","Schechinger","MGC Wolnzach","","","","","","","Miniaturgolf-Club Wolnzach e. V."]
[66526,"D","Laura","Scheder","TG Höchberg","","","","","","","Turngemeinde Höchberg von 1862 Bahnengolf e. V."]
[66524,"Sw 1","Christine","Scheder","TG Höchberg","","","","","","","Turngemeinde Höchberg von 1862 Bahnengolf e. V."]
[66525,"Sm 2","Roland","Scheder","TG Höchberg","","","","","","","Turngemeinde Höchberg von 1862 Bahnengolf e. V."]
[33583,"H","Jens","Scheffler","BGC Weseling","","","","","","","1. Bahnen-Golf-Club Wesseling 1975 e. V. "]
[65969,"Sw 2","Ingelore","Scheffler","MGC Peine","Ja","","","","","","1. Miniaturgolf-Club Peine von 1965 e. V."]
[40220,"Sm 1","Georg","Scheffzik","SSC Halver","","","","","","","SSC Halver e. V."]
[24,"Sm 1","Stefan","Scheider","SSC Halver","","","","","","","SSC Halver e. V."]
[47093,"Sm 1","Christian","Scheider","SSC Halver","","","","","","","SSC Halver e. V."]
[34772,"H","Dirk","Scheikowski","MSC Wesel","","","","","","","1. Minigolf-Sportclub Wesel 66 66 e. V. "]
[631,"Sm 2","Kurt","Schellhas","MGC Witten","","","","","","","Minigolfclub \"AS\" Witten 1963 e. V."]
[44026,"Sm 2","Horst-Dieter","Schenk","MGC Köln","","","","","","","1. Minigolf-Club Köln 1961 e. V."]
[66951,"Sm 2","Richard","Schenkel","MSC Bensheim-Auerbach","","","","","","","Minigolf-Sport-Club Bensheim-Auerbach e. V."]
[38547,"H","Peter","Scherber","MGC Bad Bocklet","","","","","","","Miniatur-Golf-Club \"Stahlquelle\", Bad Bocklet 1989 e. V."]
[67828,"Sm 2","Ulrich","Scherberger","BGC Uerdingen","","","","","","","Bahnengolf-Club Uerdingen e. V."]
[36164,"Sm 1","Markus","Scherkenbach","VfM Bottrop","","","","","","","Verein für Minigolf Bottrop e. V."]
[44856,"Sm 1","Irving","Scheunemann","MC Möve Cuxhaven","Ja","","","","","","Miniaturgolf-Club \"Möve\" Cuxhaven-Sahlenburg e. V."]
[65902,"D","Andrea","Schewcik","MC Ilvesheim","","","","","","","Miniaturgolf-Club Ilvesheim e. V."]
[65901,"Sm 1","Andreas","Schewcik",{"$f":"VLOOKUP(L2754,Kurznamen,2,0)","v":"MC Ilvesheim"},{"$f":"IF(VLOOKUP(L2754,Kurznamen,3,0)=\"Ja\",\"Ja\",\"\")","v":""},"","","","","","Miniaturgolf-Club Ilvesheim e. V."]
[30366,"Sm 1","Ralf","Schewerda","MGC Felderbachtal","","","","","","","Minigolf-Club-Felderbachtal 1964 e. V."]
[18086,"Sm 2","Hans","Schewerda","BGC Bochum","","","","","","","Bahnengolf-Sportclub Bochum 1978 e. V."]
[18085,"Sw 2","Helga","Schewerda","BGC Bochum","","","","","","","Bahnengolf-Sportclub Bochum 1978 e. V."]
[45472,"Sm 1","Thomas","Schiebel","MGC Mainz","","","","","","","Erster Mainzer Minigolf-Club e. V. 1964"]
[67747,"Sm 2","Michael","Schiffer","BGC Oberhausen","","","","","","","Bahnengolf-Club Oberhausen e. V."]
[66772,"D","Angela","Schikorra","BGV Backumer Tal","","","","","","","BGV Backumer Tal Herten e. V."]
[67447,"Sw 1","Kerstin","Schild","VfL Lohbrügge","","","","","","","Verein für Leibesübungen Lohbrügge von 1892 e. V. Abteilung Bahnengolf"]
[66294,"Sm 2","Werner","Schilitz","MSV Bad Kreuznach","","","","","","","MSV Bad Kreuznach e. V."]
[41116,"Sm 1","Alfred","Schiller","BGC Bad Füssing","","","","","","","1. Bahnengolfclub Bad Füssing e. V."]
[67835,"Sm 2","Markus","Schillhabel","MSC Bad Godesberg","","","","","","","Minigolf-Sport-Club Bad Godesberg e. V."]
[5665,"Sm 2","Adolf","Schilling","MSC Wesel","","","","","","","1. Minigolf-Sportclub Wesel 66 66 e. V. "]
[67041,"Sm 1","Arno","Schimanski","MGC Wanne-Eickel","","","","","","","Minigolfclub Rot-Weiß Wanne-Eickel e. V."]
[46946,"Sm 1","Stefan","Schimscha","FMGC Lichtenfels","","","","","","","1. Fränkischer Minigolfclub Lichtenfels 1961 e. V."]
[34905,"H","Sebastian","Schindler","MGV Eibenstock","","","","","","","Miniaturgolfverein Eibenstock 1997 e. V.\t"]
[29859,"Sm 1","Ralf","Schindler","BGC Celle","Ja","","","","","","1. Bahnen-Golf-Club Celle von 1964 e. V."]
[67481,"H","Dominik","Schirmer","MGC Ingolstadt","","","","","",""," Miniaturgolf-Club Ingolstadt e. V."]
[67683,"H","Kevin","Schirmer","MGC Ingolstadt","","","","","",""," Miniaturgolf-Club Ingolstadt e. V."]
[26183,"Sm 2","Uwe","Schirrmacher","MSC Neu-Wulstorf","","","","","","","1. Minigolf-Sport-Club Hamburg-Neu-Wulmstorf e. V."]
[36672,"H","Thomas","Schlai","BGC Illertissen","","","","","","","Bahnengolfclub Illertissen e. V."]
[63701,"H","Dominik","Schlauch","BGC Bad Berneck","","","","","","","Bahnengolf-Club e. V. Bad Berneck"]
[26002,"Sm 2","Peter","Schlauch","BGC Bad Berneck","","","","","","","Bahnengolf-Club e. V. Bad Berneck"]
[26005,"Sw 2","Anna-Maria","Schlauch","BGC Bad Berneck","","","","","","","Bahnengolf-Club e. V. Bad Berneck"]
[66312,"D","Jeanine","Schlaucher","MGC Murnau","","","","","","","Minigolfclub Murnau am Staffelsee e. V."]
[62840,"Sm 2","Gerd","Schlaudecker","MGC St. Ingbert","","","","","","","1. Minigolf-Club Saar 68 St. Ingbert e. V."]
[44479,"Sw 2","Vera","Schlaudecker","KC Homburg","","","","","","","1. Kleingolf Club Homburg-Saar 1967 e. V."]
[67822,"H","Fabian","Schlauer","TSV Arendsee","","","","","","","Turn- und Sportverein Arendsee e. V. Abteilung Minigolf"]
[38217,"D","Melanie","Schleich","MSF Brilon","","","","","","","Minigolfsportfreunde Brilon e. V."]
[38649,"D","Christina","Schleich","MSF Brilon","","","","","","","Minigolfsportfreunde Brilon e. V."]
[38218,"Sm 2","Peter","Schleich","MSF Brilon","","","","","","","Minigolfsportfreunde Brilon e. V."]
[18146,"Sm 2","Wolfgang","Schlenstedt","RKV Rheinstetten","","","","","","","Rad- und Kraftfahrervereins \"Solidarität\" Mörsch e. V. Abteilung Minigolf Wölfe Rheinstetten 02"]
[34033,"Sw 2","Annette","Schlereth","MGC Bad Bocklet","","","","","","","Miniatur-Golf-Club \"Stahlquelle\", Bad Bocklet 1989 e. V."]
[37858,"H","Sebastian","Schleser","MGC München","","","","","","","1. Miniaturgolfclub München-Feldmoching e. V."]
[66966,"H","Fabian","Schlesier","BGC Hannover","Ja",29353,"X","","","","1. Bahnen-Golf-Club Hannover e. V."]
[3738,"Sm 2","Peter","Schlesinger","Bochumer MC","","","","","","","Bochumer Minigolf-Club 1960 e. V."]
[67212,"Sm 2","Peter","Schlicksupp","MGC Bad Homburg","","","","","","","Minigolf-Club Bad Homburg e. V."]
[29721,"Sm 2","Rainer","Schlieker","MGC Murnau","","","","","","","Minigolfclub Murnau am Staffelsee e. V."]
[67722,"Sm 2","Wolfmar ","Schlögl","MGC Ravensburg","","","","","","","MGC Ravensburg-Weingarten e. V."]
[21326,"Sm 2","Hans-Günter","Schlösser","BGSV Kerpen","","","","","","","Bahnen-Golf-Sport-Vereinigung Kerpen e. V."]
[43245,"Sm 2","Rainer","Schlottermüller","BGC Hannover","Ja","","","","","","1. Bahnen-Golf-Club Hannover e. V."]
[67177,"Sw 1","Birgit","Schmäck","KGC Mönchengladbach","","","","","","","1. Klein-Golf-Club Mönchengladbach e. V."]
[67178,"Sm 2","Joachim","Schmäck","KGC Mönchengladbach","","","","","","","1. Klein-Golf-Club Mönchengladbach e. V."]
[67060,"Sm 1","Herbert","Schmalix","Münchener MC","","","","","","","1. Münchener Minigolf-Club 1962 e. V."]
[35113,"H","Markus","Schmälzle","MC Schriesheim","","","","","","","Miniaturgolf Sportclub Schriesheim e. V."]
[66742,"Jm","Kenny Marc","Schmeckenbecher","MC Lüdenscheid","","","","","","","MC 62 Lüdenscheid e. V."]
[203,"Sm 1","Michael","Schmeling","Tempelhofer MV","","","","","","","Tempelhofer Miniaturgolf Verein von 1965 e. V."]
[25894,"Sm 1","Roland","Schmid","MGF Hilzingen","","","","","","","Minigolffreunde Hilzingen 80 e. V."]
[67080,"Sm 1","Stephan","Schmid","OMGC Imgolstadt","","","","","","","Oberbayerische Minigolf-Club Ingolstadt e. V."]
[40400,"Sw 2","Barbara","Schmid","TV Niederstetten","","","","","","","Turnverein Niederstetten 1862 e. V. Abteilung Minigolf"]
[67081,"Sw 1","Margit","Schmidbauer","OMGC Imgolstadt","","","","","","","Oberbayerische Minigolf-Club Ingolstadt e. V."]
[67082,"Sm 2","Werner","Schmidbauer","OMGC Imgolstadt","","","","","","","Oberbayerische Minigolf-Club Ingolstadt e. V."]
[64760,"H","Maximilian","Schmidhuber","BGC Landshut","","","","","","","1. Bahnengolf-Club Landshut e. V."]
[42558,"Sm 1","Lothar","Schmidhuber","BGC Landshut","","","","","","","1. Bahnengolf-Club Landshut e. V."]
[33346,"H","Henry","Schmidt","FMGC Lichtenfels","","","","","","","1. Fränkischer Minigolfclub Lichtenfels 1961 e. V."]
[37848,"H","Dustin","Schmidt","MGC Homburger Land","","","","","","","MGC Homburger Land e. V."]
[37849,"H","Marvin","Schmidt","MGC Homburger Land","","","","","","","MGC Homburger Land e. V."]
[66256,"H","Maximilian","Schmidt","FMGC Lichtenfels","","","","","","","1. Fränkischer Minigolfclub Lichtenfels 1961 e. V."]
[87514,"H","Marco","Schmidt","MGC Bad Soden","","","","","","","Miniaturgolfclub Bad Soden-Salmünster e. V."]
[67624,"H","Marco","Schmidt","SG Arheilgen","","","","","","","Sportgemeinschaft Arheilgen 1876/1945 e. V. Abteilung Bahnengolf"]
[67669,"H","Dennis","Schmidt","SGC Castrop","","","","","","","Sterngolfclub Glocke Castrop e. V."]
[66761,"Jw","Hanna","Schmidt","CGC Rauschenberg","","","","","","","Cobigolf-Club Rauschenberg e. V."]
[67798,"Schm","Max","Schmidt","MGC Wanne-Eickel","","","","","","","Minigolfclub Rot-Weiß Wanne-Eickel e. V."]
[22105,"Sm 1","Frank","Schmidt","MC Neuwied","","","","","","","Miniaturgolfclub Neuwied e. V."]
[33928,"Sm 1","Thorben","Schmidt","MGC Brunsbüttel","","","","","","","Miniaturgolf-Club Brunsbüttel e. V."]
[40202,"Sm 1","Helmut","Schmidt",{"$f":"VLOOKUP(L2818,Kurznamen,2,0)","v":"MGC Biebertal"},{"$f":"IF(VLOOKUP(L2818,Kurznamen,3,0)=\"Ja\",\"Ja\",\"\")","v":""},"","","","","","Miniatur-Golf-Club Freizeitzentrum Biebertal e. V."]
[51714,"Sm 1","Christian","Schmidt","BGSC Gladbeck","","","","","","","Bahnengolfsportclub \"Gut Schlag\" Gladbeck e. V."]
[67560,"Sm 1","Thorsten","Schmidt","VfM Bottrop","","","","","","","Verein für Minigolf Bottrop e. V."]
[45345,"Sw 1","Barbara","Schmidt","FMGC Lichtenfels","","","","","","","1. Fränkischer Minigolfclub Lichtenfels 1961 e. V."]
[9197,"Sm 2","Hans-Jürgen","Schmidt","MGC Homburger Land","","","","","","","MGC Homburger Land e. V."]
[19792,"Sm 2","Dietmar","Schmidt","BIG Asperg","","","","","","","Bahnengolf-Interessen-Gemeinschaft Asperg e. V. 1982"]
[26491,"Sm 2","Olaf","Schmidt","MGC Witten","","","","","","","Minigolfclub \"AS\" Witten 1963 e. V."]
[30657,"Sm 2","Volker","Schmidt","FMGC Lichtenfels","","","","","","","1. Fränkischer Minigolfclub Lichtenfels 1961 e. V."]
[35706,"Sm 2","Peter","Schmidt","Elbhavelland","","","","","","","Elbhavelland e. V. Abteilung Minigolfsport"]
[40892,"Sm 2","Horst","Schmidt","BGC Hannover","Ja",16653,"","X","","X","1. Bahnen-Golf-Club Hannover e. V."]
[67275,"Sm 2","Peter","Schmidt","BSG Fürstenwalde","","","","","","","BSG Pneumant Fürstenwalde e. V. Abteilung Minigolf"]
[67429,"Sm 2","Klaus","Schmidt","MGC Bad Homburg","","","","","","","Minigolf-Club Bad Homburg e. V."]
[30937,"Sw 2","Heike","Schmidt","BGC Bad Nenndorf","Ja","","","","","","Bahnen-Golf-Club Bad Nenndorf e. V."]
[36324,"Sw 2","Carmen","Schmidt","BGC Hannover","Ja","","","","","","1. Bahnen-Golf-Club Hannover e. V."]
[67258,"Sw 2","Silvia","Schmidt","MGC Mannheim","","","","","","","1. Miniatur-Golf-Club Mannheim 1968 e. V."]
[67653,"Sw 2","Annemarie","Schmidt","MGC Murnau","","","","","","","Minigolfclub Murnau am Staffelsee e. V."]
[31210,"Sm 1","Ralf","Schmidt-Hess","MGF Waldshut","","","","","","","Minigolffreunde Waldshut 1974 e. V."]
[36631,"Sw 1","Sabine","Schmidt-Hess","CGC Grötzingen","","","","","","","COBI-GOLF-CLUB Blau-Gelb Grötzingen 1968 e. V."]
[67623,"D","Lisa","Schmidt-Pasewalk","SG Arheilgen","","","","","","","Sportgemeinschaft Arheilgen 1876/1945 e. V. Abteilung Bahnengolf"]
[5056,"Sm 2","Johannes","Schmiedbauer","BGC Bad Füssing","","","","","","","1. Bahnengolfclub Bad Füssing e. V."]
[67601,"Sm 2","Manfred","Schmiedlin","MGF Waldshut","","","","","","","Minigolffreunde Waldshut 1974 e. V."]
[36110,"H","Michael","Schmitt","SG Arheilgen","","","","","","","Sportgemeinschaft Arheilgen 1876/1945 e. V. Abteilung Bahnengolf"]
[67789,"D","Stefanie","Schmitt","BSV Asslar","","","","","","","Bahnengolf-Sportverein Aßlar 1987 e. V."]
[33891,"Sm 1","Uwe","Schmitt","MC Schriesheim","","","","","","","Miniaturgolf Sportclub Schriesheim e. V."]
[44955,"Sm 1","Jürgen","Schmitt","MGC Witten","","","","","","","Minigolfclub \"AS\" Witten 1963 e. V."]
[60743,"Sw 2","Ursula","Schmitt","SG Arheilgen","","","","","","","Sportgemeinschaft Arheilgen 1876/1945 e. V. Abteilung Bahnengolf"]
[36041,"Sm 1","Joachim","Schmittdiel","MGC Kassel","Ja","","","","","","1. Mini-Golfsport-Club Kassel-Vellmar 1964 e. V."]
[9449,"Sm 2","Peter","Schmitutz","MGC Viernheim","","","","","","","MGC Millennium Viernheim e. V."]
[67001,"H","Dominik","Schmitz","Kölner MC","","","","","","","Kölner Miniatur Golf Club e. V."]
[38245,"Sw 1","Sibylle","Schmitz","BGC Dormagen","","","","","","","Bahnengolf-Club Dormagen e. V."]
[67680,"Sw 2","Inge","Schmitz","MGC Wanne-Eickel","","","","","","","Minigolfclub Rot-Weiß Wanne-Eickel e. V."]
[35141,"H","Tobias","Schmolke","MSC Bensheim-Auerbach","","","","","","","Minigolf-Sport-Club Bensheim-Auerbach e. V."]
[756,"Sm 2","Axel Rolf","Schmurdy","MGC Kassel","Ja",2321,"","X","","","1. Mini-Golfsport-Club Kassel-Vellmar 1964 e. V."]
[24639,"H","Nico","Schnauer","MGC Bad Oldesloe","","","","","","","Miniaturgolfclub Bad Oldesloe von 1964 e. V."]
[64054,"Sm 1","Reinhold","Schneid","MGV Ansbach","","","","","","","MGV Ansbach e. V."]
[34319,"H","Alexander","Schneider","SG Arheilgen","","","","","","","Sportgemeinschaft Arheilgen 1876/1945 e. V. Abteilung Bahnengolf"]
[36247,"H","Andreas","Schneider","SG Arheilgen","","","","","","","Sportgemeinschaft Arheilgen 1876/1945 e. V. Abteilung Bahnengolf"]
[67804,"D","Kristin","Schneider","BGSC Gladbeck","","","","","","","Bahnengolfsportclub \"Gut Schlag\" Gladbeck e. V."]
[43681,"Sm 1","Christian","Schneider","MGC Göttingen","Ja","","","","","","1. Miniatur-Golfsport-Club 1970 Göttingen e. V."]
[43733,"Sm 1","Simon","Schneider","BGV Bergisch Land","","","","","","","Bahnengolf-Verein Bergisch Land 1962/63 e. V."]
[66666,"Sm 1","Timm","Schneider","SG Arheilgen","","","","","","","Sportgemeinschaft Arheilgen 1876/1945 e. V. Abteilung Bahnengolf"]
[66941,"Sm 1","Dirk","Schneider","BGC Paderborn","","","","","","","1. Bahnengolfclub Paderborn e. V."]
[40365,"Sw 1","Renate","Schneider","OMGC Imgolstadt","","","","","","","Oberbayerische Minigolf-Club Ingolstadt e. V."]
[61696,"Sm 2","Paul","Schneider","MGC Ludwigshafen","","","","","","","1. Miniatur-Golf-Club Ludwigshafen 1964 e. V."]
[66818,"Sm 2","Franz","Schneider","BSV Ohlsbach","","","","","","","Bahnengolfsportverein 82 Ohlsbach e. V."]
[67717,"Sm 2","Wolfgang","Schneider","BV Sennestadt","","","","","","","BV Sennestadt e. V."]
[28127,"Sm 2","Wolfgang","Schneiderbanger","MGC Bamberg","","","","","","","1. Minigolfclub Bamberg e. V."]
[67115,"Sm 1","Michael","Schnell","BSV Ohlsbach","","","","","","","Bahnengolfsportverein 82 Ohlsbach e. V."]
[47187,"Sm 1","Oliver","Schnickmann","CGC Hamm","","","","","","","Cobigolf-Verein Hamm 2019 e. V."]
[47186,"Sw 1","Stefanie","Schnickmann","CGC Hamm","","","","","","","Cobigolf-Verein Hamm 2019 e. V."]
[43936,"Sm 1","Martin","Schnittker","Bochumer MC","","","","","","","Bochumer Minigolf-Club 1960 e. V."]
[66214,"Sm 2","Jörg","Schnoor","MGC Bad Oldesloe","","","","","","","Miniaturgolfclub Bad Oldesloe von 1964 e. V."]
[67367,"Sm 2","Norbert","Schnura","Tempelhofer MV","","","","","","","Tempelhofer Miniaturgolf Verein von 1965 e. V."]
[67368,"Sw 2","Regina","Schnura","Tempelhofer MV","","","","","","","Tempelhofer Miniaturgolf Verein von 1965 e. V."]
[37048,"Sm 2","Manfred","Schöbel","HMC Büttgen","","","","","","","Hobbysport Miniaturgolfclub Büttgen e. V."]
[67182,"Sm 2","Rudolf","Schocher","MGC Diessen","","","","","","","Minigolf-Club Diessen e. V."]
[40386,"Sm 1","Thomas","Schöchlin","MGC Würzburg","","","","","","","Miniaturgolfsportverein Würzburg - Löwenbrücke e. V."]
[67539,"Sm 2","Toni","Schöll","BGC Illertissen","","","","","","","Bahnengolfclub Illertissen e. V."]
[67540,"Sw 2","Gitti","Schöll","BGC Illertissen","","","","","","","Bahnengolfclub Illertissen e. V."]
[67359,"Sm 1","Kurt","Schöllnast","BSV München","","","","","","","Bahnengolfsportverein 86 München e. V."]
[31280,"H","Lucas","Scholz","MGC Mainz","","","","","","","Erster Mainzer Minigolf-Club e. V. 1964"]
[66299,"H","Bastian","Scholz","TG Höchberg","","","","","","","Turngemeinde Höchberg von 1862 Bahnengolf e. V."]
[12780,"Sm 2","Rüdiger","Scholz","MSK Neheim-Hüsten","","","","","","","MINIGOLF-SPORT-KLUB Neheim-Hüsten e. V."]
[67261,"Sm 1","Rainer","Schölzke","MGC Bad Bocklet","","","","","","","Miniatur-Golf-Club \"Stahlquelle\", Bad Bocklet 1989 e. V."]
[35230,"Sm 2","Wolfgang","Schön",{"$f":"VLOOKUP(L2882,Kurznamen,2,0)","v":"SC Neumünster"},{"$f":"IF(VLOOKUP(L2882,Kurznamen,3,0)=\"Ja\",\"Ja\",\"\")","v":""},"","","","","","Sportclub Gut Heil Neumünster von 1881 e. V. Abteilung Miniaturgolf"]
[35267,"Sm 2","Helmut","Schön","MC Ilvesheim","","","","","","","Miniaturgolf-Club Ilvesheim e. V."]
[3389,"Sm 2","Horst","Schönfeld","BGC Northeim","Ja","","","","","","Bahnen-Golf-Club Northeim e. V."]
[34084,"Sm 2","Karl-Heinz","Schönfeld","BGC Celle","Ja","","","","","","1. Bahnen-Golf-Club Celle von 1964 e. V."]
[50889,"Sw 1","Ute","Schönherr","MGC Köln","","","","","","","1. Minigolf-Club Köln 1961 e. V."]
[66449,"H","Lukas","Schrader","MGC Olympia Kiel","","","","","","","Miniaturgolfclub Olympia Kiel e. V."]
[67529,"Jw","Julia","Schramm","MGC Bad Bodendorf","","","","","","","Miniaturgolfclub Bad Bodendorf e. V."]
[67530,"Sm 1","Oliver","Schramm","MGC Bad Bodendorf","","","","","","","Miniaturgolfclub Bad Bodendorf e. V."]
[44645,"Sm 2","Reiner","Schramm","BSV Bad Homburg","","","","","","","Bahnengolf-Sportverein Bad Homburg v.d.H. e. V."]
[67440,"Sw 1","Anja","Schray","MGC Mainz","","","","","","","Erster Mainzer Minigolf-Club e. V. 1964"]
[41008,"H","Andreas","Schreck","VfM Berlin","","","","","","","Verein für Minigolf e. V. Berlin"]
[66804,"H","Clemens","Schreiber","BGC Leipzig","","","","","","","1. Bahnen Golf Club Leipzig e. V."]
[67296,"Sw 1","Martina","Schreiber","MGC Bad Soden","","","","","","","Miniaturgolfclub Bad Soden-Salmünster e. V."]
[66205,"Sm 2","Udo","Schreiber","MGC Epe","","","","","","","1. Minigolfclub Epe 1978 e. V."]
[67295,"Sm 2","Manfred","Schreiber","MGC Bad Soden","","","","","","","Miniaturgolfclub Bad Soden-Salmünster e. V."]
[38343,"H","Christopher","Schrettl","MSG Kempten","","","","","","","Minigolf-Sport-Gemeinschaft Kempten e. V."]
[49424,"Sm 1","Thomas","Schrettl","BGC Neutraubling","","","","","","","Bahnengolf-Club Neutraubling e. V."]
[67105,"Sm 1","Harald","Schreyl","MGC Wolnzach","","","","","","","Miniaturgolf-Club Wolnzach e. V."]
[38657,"Sm 2","Gerhard","Schröck","BGC Schweinfurt","","","","","","","Bahnengolfclub Schweinfurt e. V."]
[34660,"H","Jan-Georg","Schröder","MC Elmshorn","","","","","","","Minigolf-Club Flora Elmshorn e. V."]
[40350,"Sm 1","Matthias","Schröder","MGC Dormagen-Brechten","","","","","","","Minigolfclub Dormagen - Brechten e. V."]
[66833,"Sm 1","Mario","Schröder","Berliner MSC","","","","","","","1. Berliner Miniaturgolf-Sportclub e. V. 1960"]
[66839,"Sw 1","Michaela","Schröder","MGC Bad Salzuflen","","","","","","","Minigolf-Club Bad Salzuflen e. V."]
[36274,"Sm 2","Jürgen","Schröder","MC Lüdenscheid","","","","","","","MC 62 Lüdenscheid e. V."]
[4054,"Sw 2","Gabriele","Schröder","Berliner MSC","","","","","","","1. Berliner Miniaturgolf-Sportclub e. V. 1960"]
[66827,"Jm","Jarno","Schrüfer","TSV Pfungstadt","","","","","","","TSV Pfungstadt e. V. Abteilung Bahnengolf"]
[65979,"H","Niklas","Schubert","MGC Bad Salzuflen","","","","","","","Minigolf-Club Bad Salzuflen e. V."]
[65980,"H","Finn","Schubert","MGC Bad Salzuflen","","","","","","","Minigolf-Club Bad Salzuflen e. V."]
[31091,"Sm 1","Christian","Schubert","NMC Kelheim","","","","","","","1. Niederbayerischer Minigolf-Club Kelheim e. V."]
[66632,"Sw 1","Christiane","Schubert","MGC Bergisch Gladbach","","","","","","","Minigolf-Club Bergisch Gladbach Gierath e. V."]
[6795,"Sm 2","Horst","Schuchardt","BGC Bremen","Ja","","","","","","Bahnen-Golf-Club Bremen e. V."]
[31757,"Sm 1","Torsten","Schück","MGC Mainz","","","","","","","Erster Mainzer Minigolf-Club e. V. 1964"]
[29088,"Sm 1","Bernd","Schué","BGC Goslar","Ja","","","","","","Bahnen-Golf-Club Goslar e. V."]
[26338,"Sw 2","Sabine-Simone","Schüler","MGC Bamberg","","","","","","","1. Minigolfclub Bamberg e. V."]
[66081,"H","Christoph","Schuller","MSK Olching","","","","","","","Olchinger Minigolf Sport Klub e. V."]
[66082,"H","Fabian","Schuller","MSK Olching","","","","","","","Olchinger Minigolf Sport Klub e. V."]
[67125,"D","Dana","Schüller","BGSV Kerpen","","","","","","","Bahnen-Golf-Sport-Vereinigung Kerpen e. V."]
[46043,"Sm 1","Jens","Schüller","MGC Bergisch Gladbach","","","","","","","Minigolf-Club Bergisch Gladbach Gierath e. V."]
[40246,"H","Jan","Schulte","SSC Attendorn","","","","","","","Sterngolf-Sport-Club Attendorn e. V."]
[37834,"Sm 2","Udo","Schulte","VfB Osnabrück","","","","","","","Verein für Bahnengolf Osnabrück von 1984 e. V."]
[66898,"Sm 2","Michael","Schulte","MGC Paderborn","","","","","","","1. Minigolf-Club Paderborn 1980 e. V."]
[67286,"Sm 2","Christian","Schultes","MSK Olching","","","","","","","Olchinger Minigolf Sport Klub e. V."]
[67701,"H","Alexander","Schulz","BGC Bochum","","","","","","","Bahnengolf-Sportclub Bochum 1978 e. V."]
[31848,"Sm 1","Ralf","Schulz","MC Möve Cuxhaven","Ja","","","","","","Miniaturgolf-Club \"Möve\" Cuxhaven-Sahlenburg e. V."]
[43682,"Sm 1","Matthias","Schulz","MGC Göttingen","Ja",18132,"","X","","","1. Miniatur-Golfsport-Club 1970 Göttingen e. V."]
[45666,"Sm 1","Hans-Jürgen","Schulz","MC Möve Cuxhaven","Ja","","","","","","Miniaturgolf-Club \"Möve\" Cuxhaven-Sahlenburg e. V."]
[38181,"Sm 2","Peter","Schulz","SV Lurup","","","","","","","Sportverein Lurup-Hamburg von 1923 e. V. Abteilung Bahnengolf"]
[66936,"H","Jonas","Schulze","MSC Neu-Wulstorf","","","","","","","1. Minigolf-Sport-Club Hamburg-Neu-Wulmstorf e. V."]
[48074,"Sm 2","Klaus","Schulze","Rot-Weiß Syburg","","","","","","","Rot-Weiß Syburg 1960 e. V."]
[66673,"H","Stefan","Schumacher","MGC Tuttlingen","","","","","","","Erster Minigolf - Club Tuttlingen e. V."]
[67112,"H","Danny","Schumacher","MC Gelsenkirchen","","","","","","","1. Minigolf Club Gelsenkirchen e. V."]
[67114,"H","David","Schumacher","MC Gelsenkirchen","","","","","","","1. Minigolf Club Gelsenkirchen e. V."]
[37475,"D","Sarah","Schumacher","MGC Dormagen-Brechten","","","","","","","Minigolfclub Dormagen - Brechten e. V."]
[66672,"Jw","Silvia","Schumacher","BSV Inzlingen","","","","","","","Bahnengolf-Sportverein Inzlingen 1979 e. V."]
[31332,"Sm 1","Wolfgang","Schumacher","BSV Inzlingen","","","","","","","Bahnengolf-Sportverein Inzlingen 1979 e. V."]
[3386,"Sm 2","Klaus","Schumacher","Kölner MC","","","","","","","Kölner Miniatur Golf Club e. V."]
[67600,"D","Doreen","Schumann","HMC Büttgen","","","","","","","Hobbysport Miniaturgolfclub Büttgen e. V."]
[49856,"Sm 2","Herbert","Schüngel","BGC Essen","","","","","","","Bahnengolf - Club Assindia Essen e. V."]
[49580,"Sw 2","Petra","Schüngel","BGC Essen","","","","","","","Bahnengolf - Club Assindia Essen e. V."]
[67826,"Sm 2","Rainer","Schuppenhauer","Hamburger MC","","","","","","","Hamburger Minigolf Club von 1965 e. V."]
[30255,"Sm 2","Herbert","Schurig","VfL Lohbrügge","","","","","","","Verein für Leibesübungen Lohbrügge von 1892 e. V. Abteilung Bahnengolf"]
[33960,"Sw 2","Susanne","Schürmann","BGC Weseling","","","","","","","1. Bahnen-Golf-Club Wesseling 1975 e. V. "]
[47009,"Sm 1","Wolfgang","Schury","MGC Würzburg","","","","","","","Miniaturgolfsportverein Würzburg - Löwenbrücke e. V."]
[67347,"Jw","Jana","Schüßler","MSC Bensheim-Auerbach","","","","","","","Minigolf-Sport-Club Bensheim-Auerbach e. V."]
[67538,"Schw","Sophie","Schüßler",{"$f":"VLOOKUP(L2946,Kurznamen,2,0)","v":"MSC Bensheim-Auerbach"},{"$f":"IF(VLOOKUP(L2946,Kurznamen,3,0)=\"Ja\",\"Ja\",\"\")","v":""},"","","","","","Minigolf-Sport-Club Bensheim-Auerbach e. V."]
[23509,"H","David","Schuster","MGC Ludwigshafen","","","","","","","1. Miniatur-Golf-Club Ludwigshafen 1964 e. V."]
[38046,"Sm 1","Oliver","Schuster","BGC Oberhausen","","","","","","","Bahnengolf-Club Oberhausen e. V."]
[38154,"Sw 1","Alexandra","Schuster","BGC Oberhausen","","","","","","","Bahnengolf-Club Oberhausen e. V."]
[4645,"Sm 2","Bernhard","Schütterle","BGC Rheinau-Freistett","","","","","","","BGC Rheinau-Freistett e. V."]
[37112,"H","Ronny","Schüttler","SG Weiterstadt","","","","","","","Sportgemeinde 1886 e. V. Weiterstadt Abteilung Bahnengolf"]
[41299,"Sm 1","Rainer","Schütz","BGC Heilbronn","","","","","","","Bahnengolf Club Heilbronn e. V."]
[32907,"Sm 2","Bernd","Schwab","SC Bad Münder","Ja",11116,"","X","","X","Sportclub Bad Münder e. V. Abteilung Bahnengolf"]
[32908,"Sw 2","Marianne","Schwab","SC Bad Münder","Ja","","","","","","Sportclub Bad Münder e. V. Abteilung Bahnengolf"]
[67499,"Sm 1","Raimund","Schwägerl","MGC Murnau","","","","","","","Minigolfclub Murnau am Staffelsee e. V."]
[66470,"Jm","Tobias","Schwarz","MSK Olching","","","","","","","Olchinger Minigolf Sport Klub e. V."]
[66857,"Jm","Luca","Schwarz","MGC Karlshagen","","","","","","","Minigolfclub Karlshagen e. V."]
[67094,"Schm","Dominik","Schwarz","MSK Olching","","","","","","","Olchinger Minigolf Sport Klub e. V."]
[35523,"Sw 1","Rosemarie","Schwarz","MSC Bensheim-Auerbach","","","","","","","Minigolf-Sport-Club Bensheim-Auerbach e. V."]
[49255,"Sm 2","Detlef","Schwarz","MC Möve Cuxhaven","Ja","","","","","","Miniaturgolf-Club \"Möve\" Cuxhaven-Sahlenburg e. V."]
[2284,"Sm 2","Egon","Schwarz","MGC Karlshagen","","","","","","","Minigolfclub Karlshagen e. V."]
[2283,"Sw 2","Anita","Schwarz","MGC Karlshagen","","","","","","","Minigolfclub Karlshagen e. V."]
[23183,"Sm 2","Karl-Albert","Schweizer","MGC Ludwigshafen","","","","","","","1. Miniatur-Golf-Club Ludwigshafen 1964 e. V."]
[45141,"Sm 1","Uwe","Schwer","MC Ilvesheim","","","","","","","Miniaturgolf-Club Ilvesheim e. V."]
[22937,"Sm 2","Bernd","Schwer","MC Ilvesheim","","","","","","","Miniaturgolf-Club Ilvesheim e. V."]
[67536,"Sw 1","Petra","Schwicker","BSV München","","","","","","","Bahnengolfsportverein 86 München e. V."]
[33361,"H","Sebastian","Schwind","BGC Dormagen","","","","","","","Bahnengolf-Club Dormagen e. V."]
[35763,"H","Sebastian","Schwind","MGC Ludwigshafen","","","","","","","1. Miniatur-Golf-Club Ludwigshafen 1964 e. V."]
[36108,"Sm 2","Karl-Willi","Schwind","BGC Dormagen","","","","","","","Bahnengolf-Club Dormagen e. V."]
[36107,"Sw 2","Regina","Schwind","BGC Dormagen","","","","","","","Bahnengolf-Club Dormagen e. V."]
[40968,"Sm 1","Markus","Schwinger","BGSC Gladbeck","","","","","","","Bahnengolfsportclub \"Gut Schlag\" Gladbeck e. V."]
[31144,"Sm 2","Uwe","Seeland","BSC Ennepetal","","","","","","","Bahngolf-Sport-Club Ennepetal e. V."]
[49464,"Sm 2","Norbert","Seelig","BGC Bochum","","","","","","","Bahnengolf-Sportclub Bochum 1978 e. V."]
[35801,"Sm 2","Gerald","Seher","TSV Salzgitter","Ja","","","","","","Turn- und Sportverein Salzgitter e. V. Abteilung Bahnengolf"]
[66056,"H","Alexander","Sehm","MSG Kempten","","","","","","","Minigolf-Sport-Gemeinschaft Kempten e. V."]
[67716,"Sm 2","Dieter","Seibert","SV Dreieichenhain","","","","","","","Sportverein 1890 e. V. Dreieichenhain Abteilung Bahnengolf"]
[50389,"Sm 1","Martin","Seidel","MGC putter Künzell","","","","","","","Minigolfclub putter Künzell 1970 e. V."]
[67273,"Sm 1","Dirk","Seidel","VfM Berlin","","","","","","","Verein für Minigolf e. V. Berlin"]
[37395,"Sm 2","Andreas","Seidel","MV Lankwitzer Dragons","","","","","","","MV Lankwitzer Dragons e. V."]
[66621,"Sm 2","Heribert","Seidl","BGC Neutraubling","","","","","","","Bahnengolf-Club Neutraubling e. V."]
[50138,"H","Frank","Seidler","BGSV Kerpen","","","","","","","Bahnen-Golf-Sport-Vereinigung Kerpen e. V."]
[66364,"H","Noah","Seifert","BGV Backumer Tal","","","","","","","BGV Backumer Tal Herten e. V."]
[66819,"Jm","Colin","Seifert","MGC Dormagen-Brechten","","","","","","","Minigolfclub Dormagen - Brechten e. V."]
[66472,"Sm 1","Stefan","Seifert","BGV Backumer Tal","","","","","","","BGV Backumer Tal Herten e. V."]
[67133,"Sm 2","Uwe","Seifert","MSK Olching","","","","","","","Olchinger Minigolf Sport Klub e. V."]
[67438,"Sw 1","Sabine","Seiferth","PTSV Hof","","","","","","","Post- und Telekom-Sportverein Hof e. V. Abteilung Minigolf "]
[41018,"Sm 1","Oliver","Seilz","Reinickendorfer MGC","","","","","","","Reinickendorfer Miniatur - Golfsport - Club e. V."]
[44841,"Sm 2","Rainer","Seinsche","MGC Homburger Land","","","","","","","MGC Homburger Land e. V."]
[45788,"Sm 1","Heiko","Selka","MSK Neheim-Hüsten","","","","","","","MINIGOLF-SPORT-KLUB Neheim-Hüsten e. V."]
[45198,"Sm 1","Thorsten","Semrau","SGC Castrop","","","","","","","Sterngolfclub Glocke Castrop e. V."]
[67616,"Schm","Finlay","Sender","SV Gebhardshagen","Ja","","","","","","SV Glück Auf 1901 Gebhardshagen e. V. Abteilung Minigolf"]
[66859,"D","Jessica","Senke","MGC Wanne-Eickel","","","","","","","Minigolfclub Rot-Weiß Wanne-Eickel e. V."]
[66858,"Sm 1","Andreas","Senke","MGC Wanne-Eickel","","","","","","","Minigolfclub Rot-Weiß Wanne-Eickel e. V."]
[6721,"Sw 2","Bärbel","Senke","MGC Wanne-Eickel","","","","","","","Minigolfclub Rot-Weiß Wanne-Eickel e. V."]
[66781,"D","Corinna","Serfling","MSG Kempten","","","","","","","Minigolf-Sport-Gemeinschaft Kempten e. V."]
[66873,"H","Moritz","Sesselmann","FMGC Lichtenfels","","","","","","","1. Fränkischer Minigolfclub Lichtenfels 1961 e. V."]
[67237,"H","Christoph","Sesselmann","FMGC Lichtenfels","","","","","","","1. Fränkischer Minigolfclub Lichtenfels 1961 e. V."]
[34720,"Sm 2","Wolfgang","Sessler","BGC Landshut","","","","","","","1. Bahnengolf-Club Landshut e. V."]
[34717,"Sw 2","Susanne","Sessler","BGC Landshut","","","","","","","1. Bahnengolf-Club Landshut e. V."]
[40401,"Sm 2","Jürgen","Seubert","TV Niederstetten","","","","","","","Turnverein Niederstetten 1862 e. V. Abteilung Minigolf"]
[31289,"H","Andreas","Seumenicht","TSV Kücknitz","","","","","","","Turn - und Sportverein Kücknitz von 1911 e. V. Abteilung Bahnengolf"]
[48952,"Sm 1","Norbert","Seus","MGC Wertheim","","","","","","","Minigolfdub Wertheim ´91 e. V."]
[30411,"H","Andreas","Seyen","MC Möve Cuxhaven","Ja","","","","","","Miniaturgolf-Club \"Möve\" Cuxhaven-Sahlenburg e. V."]
[67695,"Schm","Ban","Shen","Münchener MC","","","","","","","1. Münchener Minigolf-Club 1962 e. V."]
[67694,"Schw","Yue","Shen","Münchener MC","","","","","","","1. Münchener Minigolf-Club 1962 e. V."]
[22127,"Sm 2","Zoltan","Sic","MGC Bad Homburg","","","","","","","Minigolf-Club Bad Homburg e. V."]
[6728,"Sw 2","Terezia","Sic","MGC Bad Homburg","","","","","","","Minigolf-Club Bad Homburg e. V."]
[66620,"Sm 1","Markus","Sieber","ASV Pegnitz","","","","","","","Allgemeiner Sportverein Pegnitz e. V. Abteilung Minigolf"]
[34384,"Sm 2","Erich","Siebert","MGC Wetzlar","","","","","","","Miniatur-Golf-Club Wetzlar e. V."]
[29580,"H","Stefan","Siebold",{"$f":"VLOOKUP(L3010,Kurznamen,2,0)","v":"MGC Bad Oldesloe"},{"$f":"IF(VLOOKUP(L3010,Kurznamen,3,0)=\"Ja\",\"Ja\",\"\")","v":""},"","","","","","Miniaturgolfclub Bad Oldesloe von 1964 e. V."]
[41009,"H","Thorben","Sielaff","Tempelhofer MV","","","","","","","Tempelhofer Miniaturgolf Verein von 1965 e. V."]
[67388,"H","Jörg","Sienknecht","BGC Schweinfurt","","","","","","","Bahnengolfclub Schweinfurt e. V."]
[41468,"Sm 1","Bernd","Sierakowski","MGC Kassel","Ja","","","","","","1. Mini-Golfsport-Club Kassel-Vellmar 1964 e. V."]
[66076,"Sw 1","Andrea","Silex","VfB Neugattersleben","","","","","","","VfB 21 Neugattersleben e. V."]
[65957,"Sm 2","Gerald","Silex","VfB Neugattersleben","","","","","","","VfB 21 Neugattersleben e. V."]
[66140,"D","Jasmine","Simmerock","MGC Bad Soden","","","","","","","Miniaturgolfclub Bad Soden-Salmünster e. V."]
[26101,"Sm 2","Frank","Simons","Kölner MC","","","","","","","Kölner Miniatur Golf Club e. V."]
[48352,"Sm 2","Dirk","Sindorf","MC Rheinhausen","","","","","","","1. Minigolf-Club Rheinhausen e. V."]
[43922,"Sm 2","Michael","Sinzenich","BGSV Kerpen","","","","","","","Bahnen-Golf-Sport-Vereinigung Kerpen e. V."]
[29482,"Sw 2","Renate","Sinzenich","BGSV Kerpen","","","","","","","Bahnen-Golf-Sport-Vereinigung Kerpen e. V."]
[34564,"Sm 2","Gerald","Siol","SC Bad Münder","Ja",12666,"","X","","","Sportclub Bad Münder e. V. Abteilung Bahnengolf"]
[67721,"Sw 2","Christelle","Sippel","BGC Neutraubling","","","","","","","Bahnengolf-Club Neutraubling e. V."]
[31559,"Sm 1","Norbert","Skowronsky","MGC Bad Salzuflen","","","","","","","Minigolf-Club Bad Salzuflen e. V."]
[34954,"Sm 1","Andreas","Slowig","BGC Kiel-West","","","","","","","Bahnen-Golf-Club Kiel-West e. V."]
[67166,"H","Marek","Smejkal","BGS Hardenberg","","","","","","","BGS Hardenberg-Pötter e. V."]
[44768,"Sm 1","Thomas","Smyczek","TSV Pfungstadt","","","","","","","TSV Pfungstadt e. V. Abteilung Bahnengolf"]
[17842,"Sw 2","Herma","Snaga","BGC Hannover","Ja","","","","","","1. Bahnen-Golf-Club Hannover e. V."]
[34030,"Sm 2","Siegfried","Söchting","SC Bad Münder","Ja","","","","","","Sportclub Bad Münder e. V. Abteilung Bahnengolf"]
[38156,"Sm 1","Markus","Sodenkamp","MSK Neheim-Hüsten","","","","","","","MINIGOLF-SPORT-KLUB Neheim-Hüsten e. V."]
[25441,"Sm 2","Bert-Rainer","Soest","MGC Homburger Land","","","","","","","MGC Homburger Land e. V."]
[30548,"Sw 2","Heike","Solarski","KGC Frankfurt","","","","","","","Kleingolfclub Waldstadion e. V. Frankfurt am Main\t"]
[66335,"H","Matthias","Söldner","MGC Würzburg","","","","","","","Miniaturgolfsportverein Würzburg - Löwenbrücke e. V."]
[25756,"Sm 2","Sebastian","Solleder","MGC Wolnzach","","","","","","","Miniaturgolf-Club Wolnzach e. V."]
[66973,"H","Reto","Sommer","MGC Mainz","","","","","","","Erster Mainzer Minigolf-Club e. V. 1964"]
[67355,"Schw","Zoe-Loreen","Sommer","MSG Kempten","","","","","","","Minigolf-Sport-Gemeinschaft Kempten e. V."]
[36488,"Sm 1","Ralf","Sommer","MSG Kempten","","","","","","","Minigolf-Sport-Gemeinschaft Kempten e. V."]
[49260,"H","Christian","Somnitz","MC Möve Cuxhaven","Ja",21003,"","","X","X","Miniaturgolf-Club \"Möve\" Cuxhaven-Sahlenburg e. V."]
[67688,"Sw 1","Sabine","Sonntag","MGF Kempten","","","","","","","Minigolf-Freunde Steinbruch Kempten e. V."]
[36572,"Sm 2","Uwe","Sonntag","MGF Kempten","","","","","","","Minigolf-Freunde Steinbruch Kempten e. V."]
[33951,"Sm 2","Rainer","Sorgenfrei","BGC Illertissen","","","","","","","Bahnengolfclub Illertissen e. V."]
[33712,"D","Britta","Spandau","MGC Peine","Ja",11820,"","X","","X","1. Miniaturgolf-Club Peine von 1965 e. V."]
[42332,"Sm 1","Christian","Spandau","TSV Salzgitter","Ja",17396,"","X","","X","Turn- und Sportverein Salzgitter e. V. Abteilung Bahnengolf"]
[34546,"Sm 2","Ernst","Spanner","BGC Illertissen","","","","","","","Bahnengolfclub Illertissen e. V."]
[64594,"Sm 1","Peter","Spehn","MGC Bad Waldsee","","","","","","","Minigolf-Club Bad Waldsee 1990 e. V."]
[66545,"Sm 1","Jeffrey","Spence","MGC Bad Homburg","","","","","","","Minigolf-Club Bad Homburg e. V."]
[66546,"Sw 1","Manuela","Spence-Kunz","MGC Bad Homburg","","","","","","","Minigolf-Club Bad Homburg e. V."]
[37666,"Sm 1","Christian","Spennesberger","MGC Murnau","","","","","","","Minigolfclub Murnau am Staffelsee e. V."]
[40159,"H","Sascha","Sperling","BGC Diepholz","Ja","","","","","","Bahnen-Golf-Club Diepholz e. V."]
[40389,"H","Sven","Sperling","BGC Bad Nenndorf","Ja","","","","","","Bahnen-Golf-Club Bad Nenndorf e. V."]
[64884,"H","Kai-Rudolph","Sperling","SC Bad Münder","Ja","","","","","","Sportclub Bad Münder e. V. Abteilung Bahnengolf"]
[51629,"Sm 1","Sascha","Sperling","SC Bad Münder","Ja",21789,"X","","","","Sportclub Bad Münder e. V. Abteilung Bahnengolf"]
[35640,"Sm 1","Frank","Spettel","MGC Wertheim","","","","","","","Minigolfdub Wertheim ´91 e. V."]
[6280,"Sw 2","Maria","Spieleder","BGC Neutraubling","","","","","","","Bahnengolf-Club Neutraubling e. V."]
[31489,"Sm 2","Detlef","Spielfeld","Rot-Weiß Syburg","","","","","","","Rot-Weiß Syburg 1960 e. V."]
[31503,"Sm 2","Manfred","Spielfeld","SGC Hagen","","","","","","","Sterngolf-Club Hagen e. V."]
[49066,"Sm 1","Thomas","Spies","HMC Büttgen","","","","","","","Hobbysport Miniaturgolfclub Büttgen e. V."]
[41300,"Sm 2","Sepp","Splettstößer","BSV Ohlsbach","","","","","","","Bahnengolfsportverein 82 Ohlsbach e. V."]
[26787,"Sm 1","Volker","Spohr","BGC Leipzig","","","","","","","1. Bahnen Golf Club Leipzig e. V."]
[36205,"H","Sascha","Spreier","KC Homburg","","","","","","","1. Kleingolf Club Homburg-Saar 1967 e. V."]
[34782,"H","Roman","Springer","OMGC Imgolstadt","","","","","","","Oberbayerische Minigolf-Club Ingolstadt e. V."]
[35081,"Sm 2","Wilfried","Springer","OMGC Imgolstadt","","","","","","","Oberbayerische Minigolf-Club Ingolstadt e. V."]
[34841,"Sw 2","Rosmarie","Springer","OMGC Imgolstadt","","","","","","","Oberbayerische Minigolf-Club Ingolstadt e. V."]
[67570,"Sw 2","Marianne","Springer","BGC Bildstock","","","","","","","Bahnen-Golf-Club Bildstock e. V."]
[31572,"H","Lars","Springob","SSC Attendorn","","","","","","","Sterngolf-Sport-Club Attendorn e. V."]
[38477,"H","René","Springob","MSK Neheim-Hüsten","","","","","","","MINIGOLF-SPORT-KLUB Neheim-Hüsten e. V."]
[64598,"Sm 1","Patric","Sprung","BGC Bad Mergentheim","","","","","","","Bahnen-Golf-Club Bad Mergentheim e. V."]
[50895,"Sm 2","Georg","Stabl","SSV Ulm","","","","","","","Schwimm- und Sportverein Ulm 1846 e. V. Abteilung Bahnengolf"]
[67285,"Schm","Leon","Staeubert","MSK Olching","","","","","","","Olchinger Minigolf Sport Klub e. V."]
[64940,"H","Jan","Stahmann","MGC Kassel","Ja","","","","","","1. Mini-Golfsport-Club Kassel-Vellmar 1964 e. V."]
[67520,"Schm","Julius","Stahmann","MGC Kassel","Ja","","","","","","1. Mini-Golfsport-Club Kassel-Vellmar 1964 e. V."]
[66480,"H","Sebastian","Stallkamp","Osnabrücker MC","","","","","","","Osnabrücker Minigolf Club von 1963 e. V."]
[66704,"Sm 1","Thomas","Stallkamp","MGC Georgsmarienhütte","","","","","","","Minigolf-Club Georgsmarienhütte e. V."]
[43996,"Sm 1","Sebastian","Stallmann","MGC Marl","","","","","","","Mini Golf Club Marl 1960 e. V."]
[24288,"Sm 2","Dirk","Stamm",{"$f":"VLOOKUP(L3074,Kurznamen,2,0)","v":"Essener CGC"},{"$f":"IF(VLOOKUP(L3074,Kurznamen,3,0)=\"Ja\",\"Ja\",\"\")","v":""},"","","","","","1. Essener cobiGOLF - Club \"Blau-Gold\" e. V."]
[38295,"Sw 2","Anita","Stamm","Essener CGC","","","","","","","1. Essener cobiGOLF - Club \"Blau-Gold\" e. V."]
[33125,"Sm 1","Siegfried","Stanchly","BGC Heilbronn","","","","","","","Bahnengolf Club Heilbronn e. V."]
[31756,"Sm 1","Carsten","Stang","MGC Bad Hersfeld","","","","","","","Miniatur-Golf-Club Bad Hersfeld e. V."]
[64902,"H","Tim-Niklas","Stange","BGC Hannover","Ja","","","","","","1. Bahnen-Golf-Club Hannover e. V."]
[1989,"Sm 1","Michael","Stange","BGC Hannover","Ja",3553,"X","","","","1. Bahnen-Golf-Club Hannover e. V."]
[2241,"Sw 1","Anja","Stange","BGC Hannover","Ja","","","","","","1. Bahnen-Golf-Club Hannover e. V."]
[34799,"Sm 2","Hans-Werner","Stange","SV Lurup","","","","","","","Sportverein Lurup-Hamburg von 1923 e. V. Abteilung Bahnengolf"]
[66867,"Sm 2","Karl","Stängl","BGC Landshut","","","","","","","1. Bahnengolf-Club Landshut e. V."]
[29997,"Sm 1","Ulrich","Stappenbeck","BGC Weseling","","","","","","","1. Bahnen-Golf-Club Wesseling 1975 e. V. "]
[45118,"Sm 2","Wolfgang","Stargardt","MGC Metzingen","","","","","","","1. Miniaturgolf Club Metzingen e. V."]
[65465,"H","Florian","Stark","MGC Olympia Kiel","","","","","","","Miniaturgolfclub Olympia Kiel e. V."]
[3524,"Sm 2","Rupert","Stark","OMGC Imgolstadt","","","","","","","Oberbayerische Minigolf-Club Ingolstadt e. V."]
[3568,"Sm 2","Werner","Starke","MSK Olching","","","","","","","Olchinger Minigolf Sport Klub e. V."]
[32959,"Sm 1","Thomas","Staska","BSV München","","","","","","","Bahnengolfsportverein 86 München e. V."]
[66934,"H","Marcel","Staudt","MC Schriesheim","","","","","","","Miniaturgolf Sportclub Schriesheim e. V."]
[40425,"Sw 1","Ilka","Stautmeister","Elbhavelland","","","","","","","Elbhavelland e. V. Abteilung Minigolfsport"]
[5053,"Sm 2","Werner","Steeger","SSC Halver","","","","","","","SSC Halver e. V."]
[67304,"D","Iris","Steffens-Bruelheide","MGC Bad Salzuflen","","","","","","","Minigolf-Club Bad Salzuflen e. V."]
[27838,"H","Ulf","Stegmaier","BIG Asperg","","","","","","","Bahnengolf-Interessen-Gemeinschaft Asperg e. V. 1982"]
[67585,"Schm","Louis","Stegmayr","MGC Bad Feilnbach","","","","","","","Minigolfclub Bad Feilnbach e. V."]
[66897,"Sm 1","Udo","Stegmayr","MGC Bad Feilnbach","","","","","","","Minigolfclub Bad Feilnbach e. V."]
[67659,"H","Thomas","Steidle","BIG Ingelfingen","","","","","","","Bahnengolf Interessen-Gemeinschaft Ingelfingen 2020 e. V."]
[44123,"Sm 2","Uwe","Steier","NDE Miniaturgolf","","","","","","","Niendorfer Miniaturgolf-Club von 1963 e. V."]
[44379,"Sw 1","Sonja","Steinburg","MGC Dormagen-Brechten","","","","","","","Minigolfclub Dormagen - Brechten e. V."]
[6796,"Sm 2","Ralf","Steinhausen","BGC Bremen","Ja",5098,"","X","","X","Bahnen-Golf-Club Bremen e. V."]
[41367,"Sm 2","Hubert","Steinhoff","MSK Neheim-Hüsten","","","","","","","MINIGOLF-SPORT-KLUB Neheim-Hüsten e. V."]
[33580,"Sm 2","William","Stellato","MGC Wertheim","","","","","","","Minigolfdub Wertheim ´91 e. V."]
[21876,"Sm 2","Friedhelm","Steller","CGC Illertal","","","","","","","Cobigolfclub Illertal Kellmünz e. V."]
[6075,"Sm 2","Klaus","Stelter","SV Lurup","","","","","","","Sportverein Lurup-Hamburg von 1923 e. V. Abteilung Bahnengolf"]
[18104,"Sm 2","Jürgen","Stelter","SV Lurup","","","","","","","Sportverein Lurup-Hamburg von 1923 e. V. Abteilung Bahnengolf"]
[6006,"Sw 2","Karin","Stelter","MC Elmshorn","","","","","","","Minigolf-Club Flora Elmshorn e. V."]
[66711,"H","Kai","Stelzer","MSK Neheim-Hüsten","","","","","","","MINIGOLF-SPORT-KLUB Neheim-Hüsten e. V."]
[37404,"D","Franziska","Stemplinger","BGC Ottobrunn","","","","","","","BGC 90 Ottobrunn e. V."]
[47402,"Sw 1","Michaela","Stemplinger","BGC Ottobrunn","","","","","","","BGC 90 Ottobrunn e. V."]
[33974,"Sm 2","Ludwig","Stemplinger","BGC Ottobrunn","","","","","","","BGC 90 Ottobrunn e. V."]
[46386,"Sm 2","Christian","Stendel","Reinickendorfer MGC","","","","","","","Reinickendorfer Miniatur - Golfsport - Club e. V."]
[66285,"Sm 1","Markus","Stern","VfB Osnabrück","",28281,"X","","","","Verein für Bahnengolf Osnabrück von 1984 e. V."]
[10099,"Sm 2","Udo","Sternemann","BGSV Castrop","","","","","","","Bahnengolfsportverein Castrop e. V. 1961"]
[66281,"Sw 2","Elisabeth","Stertkamp","BV Sennestadt","","","","","","","BV Sennestadt e. V."]
[35625,"Sm 2","Helmut","Steuer","BGC Illertissen","","","","","","","Bahnengolfclub Illertissen e. V."]
[67019,"Schm","Jan Malte","Stief","MC Lüdenscheid","","","","","","","MC 62 Lüdenscheid e. V."]
[67223,"Sm 2","Hans-Dieter","Stier","MC Weinheim","","","","","","","1. Miniaturgolf-Club Weinheim e. V."]
[67097,"H","Sören","Stift","MGC Harrislee","","","","","","","Sportverein Minigolfclub Harrislee-Wassersleben e. V."]
[30319,"H","Kris","Stille","NDE Miniaturgolf","","","","","","","Niendorfer Miniaturgolf-Club von 1963 e. V."]
[66100,"H","Thomas","Stock","MGC Bad Bodendorf","","","","","","","Miniaturgolfclub Bad Bodendorf e. V."]
[41929,"Sm 2","Manfred","Stock","MGC Bad Bodendorf","","","","","","","Miniaturgolfclub Bad Bodendorf e. V."]
[67615,"Sm 2","Harald","Stocker","MGC Bad Homburg","","","","","","","Minigolf-Club Bad Homburg e. V."]
[356,"H","Martin","Stöckle","NDE Miniaturgolf","","","","","","","Niendorfer Miniaturgolf-Club von 1963 e. V."]
[67748,"Schw","Jana","Stoklossa","BGC Bildstock","","","","","","","Bahnen-Golf-Club Bildstock e. V."]
[18249,"Sm 2","Hans","Stolt","MGC Tuttlingen","","","","","","","Erster Minigolf - Club Tuttlingen e. V."]
[67679,"Sm 1","Stefan","Stölzel","MC Elmshorn","","","","","","","Minigolf-Club Flora Elmshorn e. V."]
[22496,"H","Miroslav","Stoparic","MGC Mainz","","","","","","","Erster Mainzer Minigolf-Club e. V. 1964"]
[27937,"H","Branislav","Stoparic","MGC Mannheim","","","","","","","1. Miniatur-Golf-Club Mannheim 1968 e. V."]
[28333,"Sm 2","Martin","Stopper","BSV München","","","","","","","Bahnengolfsportverein 86 München e. V."]
[31829,"Sw 2","Erika","Stopper","BSV München","","","","","","","Bahnengolfsportverein 86 München e. V."]
[43139,"Sm 1","Frank","Störmer","CGC Hamm","","","","","","","Cobigolf-Verein Hamm 2019 e. V."]
[31301,"Sm 2","Hans-Jürgen","Stötzer","BGC Weseling","","","","","","","1. Bahnen-Golf-Club Wesseling 1975 e. V. "]
[36353,"H","Stephan","Stranka","BGC Garmisch","","","","","","","1. Bahnengolfclub Garmisch-Partenkirchen e. V."]
[66600,"Sm 2","Giuseppe","Strano","BGSC Gladbeck","","","","","","","Bahnengolfsportclub \"Gut Schlag\" Gladbeck e. V."]
[33184,"H","Christian","Straub","MGC Sulzfeld","","","","","","","Miniatur Golf Club Sulzfeld e. V."]
[35657,"H","Michael","Straub","MGC Sulzfeld","","","","","","","Miniatur Golf Club Sulzfeld e. V."]
[37045,"Sw 2","Christa","Streit","MGU Neviges","","","","","","","Minigolfunion Neviges-Odenthal 1968 e. V."]
[33658,"Sm 2","Manfred","Strohmaier","SSV Ulm","","","","","","","Schwimm- und Sportverein Ulm 1846 e. V. Abteilung Bahnengolf"]
[67396,"Sw 1","Claudia","Strohmenger",{"$f":"VLOOKUP(L3138,Kurznamen,2,0)","v":"MC Weinheim"},{"$f":"IF(VLOOKUP(L3138,Kurznamen,3,0)=\"Ja\",\"Ja\",\"\")","v":""},"","","","","","1. Miniaturgolf-Club Weinheim e. V."]
[67394,"Sm 2","Uwe","Strohmenger","MC Weinheim","","","","","","","1. Miniaturgolf-Club Weinheim e. V."]
[34700,"Sm 1","Holger","Strube","MGC Bad Soden","","","","","","","Miniaturgolfclub Bad Soden-Salmünster e. V."]
[35809,"Sw 2","Catalina","Strube","MGC Bad Soden","","","","","","","Miniaturgolfclub Bad Soden-Salmünster e. V."]
[35201,"H","Bernd","Stübgen","MGC Peine","Ja","","","","","","1. Miniaturgolf-Club Peine von 1965 e. V."]
[67042,"Jm","Connor","Stübiger","BSV Asslar","","","","","","","Bahnengolf-Sportverein Aßlar 1987 e. V."]
[67776,"D","Jane","Stucki","MSK Olching","","","","","","","Olchinger Minigolf Sport Klub e. V."]
[67613,"Jm","Lukas","Stuffer","MGV Ansbach","","","","","","","MGV Ansbach e. V."]
[38224,"H","Martin","Stukan","BGC Schweinfurt","","","","","","","Bahnengolfclub Schweinfurt e. V."]
[38362,"Sm 2","Ingo","Stuppy","MGC Mannheim","","","","","","","1. Miniatur-Golf-Club Mannheim 1968 e. V."]
[37814,"H","Tobias","Sturm","MGC Murnau","","","","","","","Minigolfclub Murnau am Staffelsee e. V."]
[26576,"Sm 2","Norbert","Sturm","MGC Ingolstadt","","","","","",""," Miniaturgolf-Club Ingolstadt e. V."]
[29722,"Sm 2","Werner","Sturm","MGC Murnau","","","","","","","Minigolfclub Murnau am Staffelsee e. V."]
[64201,"Sw 2","Dietlind","Sturm","MGC Murnau","","","","","","","Minigolfclub Murnau am Staffelsee e. V."]
[37460,"Sm 2","Klaus","Stürmer","KC Homburg","","","","","","","1. Kleingolf Club Homburg-Saar 1967 e. V."]
[36587,"Sm 1","Wolfgang","Stute","MGC Schwaikheim","","","","","","","Miniaturgolf – Club Schwaikheim e. V."]
[37780,"H","Brian","Suchomel","MC Künsebeck","","","","","","","Miniaturgolf Club Tigers Künsebeck e. V."]
[43284,"Sm 2","Jürgen","Suckau","MGC Homburger Land","","","","","","","MGC Homburger Land e. V."]
[44353,"Sm 1","Frank","Südhoff","CGC Bad Hamm","","","","","","","Cobigolf-Club \"Grün-Gold\" Bad Hamm e. V."]
[26352,"Sm 1","Lutz","Suhrbier","Tempelhofer MV","","","","","","","Tempelhofer Miniaturgolf Verein von 1965 e. V."]
[44865,"Sm 1","Christopher","Süling","MC Möve Cuxhaven","Ja","","","","","","Miniaturgolf-Club \"Möve\" Cuxhaven-Sahlenburg e. V."]
[32849,"Sm 2","Hans-Gerd","Sülzen","MGS Hildesheim","Ja","","","","","","MiniGolfSportverein Hildesheim e. V."]
[32850,"Sw 2","Annelie","Sülzen","MGS Hildesheim","Ja","","","","","","MiniGolfSportverein Hildesheim e. V."]
[24727,"Sm 2","Jürgen","Summ","MGC Sulzfeld","","","","","","","Miniatur Golf Club Sulzfeld e. V."]
[6234,"Sm 2","Rudi","Surau","MSC Neu-Wulstorf","","","","","","","1. Minigolf-Sport-Club Hamburg-Neu-Wulmstorf e. V."]
[43693,"Sm 2","Michael","Sussek","BGC Wolfsburg","Ja","","","","","","1. Bahnen - Golf - Club Wolfsburg e. V."]
[36570,"H","Manuel","Szablikowski","MGC Mainz","","","","","","","Erster Mainzer Minigolf-Club e. V. 1964"]
[37981,"H","Tim","Szablikowski","MGC Mainz","","","","","","","Erster Mainzer Minigolf-Club e. V. 1964"]
[30493,"Sm 1","Bernd","Szablikowski","MGC Mainz","","","","","","","Erster Mainzer Minigolf-Club e. V. 1964"]
[44243,"Sm 1","André","Szablikowski","MGC Mainz","","","","","","","Erster Mainzer Minigolf-Club e. V. 1964"]
[29090,"Sw 1","Anke","Szablikowski","MGC Mainz","","","","","","","Erster Mainzer Minigolf-Club e. V. 1964"]
[29092,"Sw 1","Petra","Szablikowski","MGC Mainz","","","","","","","Erster Mainzer Minigolf-Club e. V. 1964"]
[25536,"Sm 2","Axel","Szablikowski","MGC Mainz","","","","","","","Erster Mainzer Minigolf-Club e. V. 1964"]
[37507,"Sm 2","Harald","Szabo","MGC Hechingen","","","","","","","1. Minigolfclub Hechingen e. V."]
[48004,"Sm 1","Jörg","Sziele","MGC Wertheim","","","","","","","Minigolfdub Wertheim ´91 e. V."]
[67272,"Sw 2","Ilka","Szukowski","BSG Fürstenwalde","","","","","","","BSG Pneumant Fürstenwalde e. V. Abteilung Minigolf"]
[27974,"Sm 2","Peter","Tabor","MGC Witten","","","","","","","Minigolfclub \"AS\" Witten 1963 e. V."]
[36355,"H","Julian","Tafel","BGC Garmisch","","","","","","","1. Bahnengolfclub Garmisch-Partenkirchen e. V."]
[38199,"H","Daniel","Tafel","BGC Garmisch","","","","","","","1. Bahnengolfclub Garmisch-Partenkirchen e. V."]
[36894,"D","Melanie","Tafel","BGC Garmisch","","","","","","","1. Bahnengolfclub Garmisch-Partenkirchen e. V."]
[45237,"Sw 1","Susanne","Tafel","BGC Garmisch","","","","","","","1. Bahnengolfclub Garmisch-Partenkirchen e. V."]
[28604,"Sm 2","Manfred","Tafel","BGC Garmisch","","","","","","","1. Bahnengolfclub Garmisch-Partenkirchen e. V."]
[65725,"Sm 2","Reinhard","Tasche","SC Wermelskirchen","","","","","","","SC-Wermelskirchen e. V."]
[65724,"Sw 2","Edeltraut","Tasche","SC Wermelskirchen","","","","","","","SC-Wermelskirchen e. V."]
[41313,"Sm 1","Angelo","Tatti","BGC Heilbronn","","","","","","","Bahnengolf Club Heilbronn e. V."]
[3621,"Sm 2","Clemente","Tatti","BGC Heilbronn","","","","","","","Bahnengolf Club Heilbronn e. V."]
[30769,"Sm 1","Volker","Tatzelt","NDE Miniaturgolf","","","","","","","Niendorfer Miniaturgolf-Club von 1963 e. V."]
[4761,"Sm 2","Peter","Taudien","MSC Bad Godesberg","","","","","","","Minigolf-Sport-Club Bad Godesberg e. V."]
[36632,"Sm 1","Gunter","Tauterat","MGC Monrepos","","","","","","","Minigolfclub Monrepos e. V."]
[36633,"Sw 1","Carmen","Tauterat","BGC Bad Mergentheim","","","","","","","Bahnen-Golf-Club Bad Mergentheim e. V."]
[33986,"Sw 2","Eleonore","Tautrims","MGC Bad Homburg","","","","","","","Minigolf-Club Bad Homburg e. V."]
[4244,"Sm 2","Peter","Tautz","VfM Bottrop","","","","","","","Verein für Minigolf Bottrop e. V."]
[5715,"Sw 2","Brigitte","Te Kamp","SC Wermelskirchen","","","","","","","SC-Wermelskirchen e. V."]
[67346,"Schm","Finn","Teetzen","MGV Bremen","Ja","","","","","","Miniatur-Golf-Verein Bremen e. V."]
[67345,"Sm 1","Michael","Teetzen","MGV Bremen","Ja","","","","","","Miniatur-Golf-Verein Bremen e. V."]
[6014,"Sm 2","Heinrich","Teine","BGSV Kerpen","","","","","","","Bahnen-Golf-Sport-Vereinigung Kerpen e. V."]
[33964,"H","Marco","Templin","BGS Hardenberg","","","","","","","BGS Hardenberg-Pötter e. V."]
[41710,"Sm 2","Michael","Tesch","BGC Paffendorf","","","","","","","Bahnengolf Club Schloß Paffendorf e. V."]
[48559,"Sm 1","Jörg","Tetzlaff","Reinickendorfer MGC","","","","","","","Reinickendorfer Miniatur - Golfsport - Club e. V."]
[50596,"H","Jan-Christoph","Theden","MGC Olympia Kiel","","","","","","","Miniaturgolfclub Olympia Kiel e. V."]
[67565,"Sm 1","Andreas","Theilig","MGC Bad Homburg","","","","","","","Minigolf-Club Bad Homburg e. V."]
[67564,"Sw 1","Petra","Theilig","BSV Bad Homburg","","","","","","","Bahnengolf-Sportverein Bad Homburg v.d.H. e. V."]
[34879,"Sm 2","Michael","Theimann","BGS Hardenberg","","","","","","","BGS Hardenberg-Pötter e. V."]
[66593,"H","Kai","Theobald","TV Nierstein","","","","","","","Turnverein 1901 e. V. Nierstein/Rhein Abteilung Minigolf"]
[66592,"H","Tobias","Theobald",{"$f":"VLOOKUP(L3202,Kurznamen,2,0)","v":"TV Nierstein"},{"$f":"IF(VLOOKUP(L3202,Kurznamen,3,0)=\"Ja\",\"Ja\",\"\")","v":""},"","","","","","Turnverein 1901 e. V. Nierstein/Rhein Abteilung Minigolf"]
[24892,"Sm 1","Matthias","Thiebes","BGC Bad Mergentheim","","","","","","","Bahnen-Golf-Club Bad Mergentheim e. V."]
[45943,"Sm 1","Stephan","Thiel","VfM Berlin","","","","","","","Verein für Minigolf e. V. Berlin"]
[43548,"Sw 1","Elke","Thiem","MSC Bensheim-Auerbach","","","","","","","Minigolf-Sport-Club Bensheim-Auerbach e. V."]
[36565,"Sm 2","Frank","Thies","BGC Northeim","Ja","","","","","","Bahnen-Golf-Club Northeim e. V."]
[48286,"Sm 2","Hans-Jürgen","Thölke","MGC Murnau","","","","","","","Minigolfclub Murnau am Staffelsee e. V."]
[38597,"H","Andreas","Thomas","MGC Ostheim/Rhön","","","","","","","Miniaturgolfclub Ostheim/Rhön e. V. "]
[67397,"Sm 2","Herbert","Thomas","BGSV Castrop","","","","","","","Bahnengolfsportverein Castrop e. V. 1961"]
[35702,"H","Tilo","Thomsen","MGC Olympia Kiel","","","","","","","Miniaturgolfclub Olympia Kiel e. V."]
[67099,"H","Jan","Thomsen","MGC Harrislee","","","","","","","Sportverein Minigolfclub Harrislee-Wassersleben e. V."]
[67815,"D","Ann-Katrin","Thomsen","MGC Wetzlar","","","","","","","Miniatur-Golf-Club Wetzlar e. V."]
[67719,"Schm","Flemming","Thomsen","MGC Brunsbüttel","","","","","","","Miniaturgolf-Club Brunsbüttel e. V."]
[67100,"Sw 1","Tanja","Thomsen","MGC Harrislee","","","","","","","Sportverein Minigolfclub Harrislee-Wassersleben e. V."]
[38501,"Sm 1","Ralf","Thren","MSC Bad Godesberg","","","","","","","Minigolf-Sport-Club Bad Godesberg e. V."]
[38502,"Sw 2","Sigrid","Thren-Bös","MSC Bad Godesberg","","","","","","","Minigolf-Sport-Club Bad Godesberg e. V."]
[37289,"H","Marwin","Throne","ASV Pegnitz","","","","","","","Allgemeiner Sportverein Pegnitz e. V. Abteilung Minigolf"]
[37290,"Sm 2","Werner","Throne","PTSV Hof","","","","","","","Post- und Telekom-Sportverein Hof e. V. Abteilung Minigolf "]
[31419,"H","Timo","Thun","MGV Bremen","Ja",10451,"","X","","","Miniatur-Golf-Verein Bremen e. V."]
[6586,"Sm 2","Dieter","Thun","MGV Bremen","Ja","","","","","","Miniatur-Golf-Verein Bremen e. V."]
[41317,"Sm 1","Thomas","Thusek","BGC Heilbronn","","","","","","","Bahnengolf Club Heilbronn e. V."]
[26670,"Sm 2","Hans-Joachim","Thüsen","MGC Kassel","Ja",7972,"","X","","X","1. Mini-Golfsport-Club Kassel-Vellmar 1964 e. V."]
[66788,"H","Michael","Tiedtke","MGV Bremen","Ja",29121,"X","","","X","Miniatur-Golf-Verein Bremen e. V."]
[67326,"D","Marlene","Tietz","MSK Neheim-Hüsten","","","","","","","MINIGOLF-SPORT-KLUB Neheim-Hüsten e. V."]
[48644,"H","Axel Eric","Timm","TSV Pfungstadt","","","","","","","TSV Pfungstadt e. V. Abteilung Bahnengolf"]
[67708,"H","Andreas","Timmer","TSV Arendsee","","","","","","","Turn- und Sportverein Arendsee e. V. Abteilung Minigolf"]
[67814,"Sm 1","Stefan","Tinibel","Bochumer MC","","","","","","","Bochumer Minigolf-Club 1960 e. V."]
[6771,"Sm 2","Dietmar","Tinney","Hamburger MC","","","","","","","Hamburger Minigolf Club von 1965 e. V."]
[43144,"Sm 2","Jürgen","Tismer","MGC Bad Salzuflen","","","","","","","Minigolf-Club Bad Salzuflen e. V."]
[24603,"Sm 2","Klaus","Todtenhöfer","BGC Dormagen","","","","","","","Bahnengolf-Club Dormagen e. V."]
[31347,"Sm 1","Ingolf","Tolk","MGC Tuttlingen","","","","","","","Erster Minigolf - Club Tuttlingen e. V."]
[37500,"H","Mathias","Tomkowitz","CGC Hamm","","","","","","","Cobigolf-Verein Hamm 2019 e. V."]
[32802,"D","Stefanie","Tomkowitz","CGC Hamm","","","","","","","Cobigolf-Verein Hamm 2019 e. V."]
[29648,"H","Michael","Töpelt","BGC Leipzig","","","","","","","1. Bahnen Golf Club Leipzig e. V."]
[37907,"D","Eva","Töpelt","BGC Leipzig","","","","","","","1. Bahnen Golf Club Leipzig e. V."]
[67830,"Jm","Alexander","Töppe","Reinickendorfer MGC","","","","","","","Reinickendorfer Miniatur - Golfsport - Club e. V."]
[67829,"Schw","Ellena","Töppe","Reinickendorfer MGC","","","","","","","Reinickendorfer Miniatur - Golfsport - Club e. V."]
[37793,"Sm 2","Jürgen","Torka","MC Gelsenkirchen","","","","","","","1. Minigolf Club Gelsenkirchen e. V."]
[27087,"Sm 1","Harald","Träger","MGC Bad Salzuflen","","","","","","","Minigolf-Club Bad Salzuflen e. V."]
[30869,"Sm 1","Andreas","Träger","MSC Bensheim-Auerbach","","","","","","","Minigolf-Sport-Club Bensheim-Auerbach e. V."]
[66435,"H","Manuel","Tramp","KSV Baltrum","","","","","","","Kultur- und Sportverein Baltrum e. V. Sparte Cobigolf"]
[43716,"Sm 2","Karl","Trauner","BSV München","","","","","","","Bahnengolfsportverein 86 München e. V."]
[43715,"Sw 2","Anneliese","Trauner","BSV München","","","","","","","Bahnengolfsportverein 86 München e. V."]
[36781,"Sm 1","Clemens","Trautmann","VfM Berlin","","","","","","","Verein für Minigolf e. V. Berlin"]
[67314,"Sm 2","Herbert","Trautmann","MGC Bad Homburg","","","","","","","Minigolf-Club Bad Homburg e. V."]
[5274,"Sm 2","Franz","Treffer","OMGC Imgolstadt","","","","","","","Oberbayerische Minigolf-Club Ingolstadt e. V."]
[47135,"Sm 2","Bernd","Trempenau","MGC Bad Salzuflen","","","","","","","Minigolf-Club Bad Salzuflen e. V."]
[38530,"H","Matthias","Trenz","BGC Bildstock","","","","","","","Bahnen-Golf-Club Bildstock e. V."]
[66644,"Sw 1","Christine","Trepesch","MGC Tuttlingen","","","","","","","Erster Minigolf - Club Tuttlingen e. V."]
[6191,"Sm 2","Peter","Trettl","MGC putter Künzell","","","","","","","Minigolfclub putter Künzell 1970 e. V."]
[17987,"Sm 2","Adi","Trillges","BGSV Kerpen","","","","","","","Bahnen-Golf-Sport-Vereinigung Kerpen e. V."]
[4880,"Sw 2","Brigitte","Trillges","BGSV Kerpen","","","","","","","Bahnen-Golf-Sport-Vereinigung Kerpen e. V."]
[36623,"Sm 2","Werner","Trinkl","MSK Olching","","","","","","","Olchinger Minigolf Sport Klub e. V."]
[36625,"Sw 2","Bettina","Trinkl","MSK Olching","","","","","","","Olchinger Minigolf Sport Klub e. V."]
[66640,"Schm","Levi","Tritsch","MSC Bensheim-Auerbach","","","","","","","Minigolf-Sport-Club Bensheim-Auerbach e. V."]
[36489,"D","Katharina","Trojak","MSG Kempten","","","","","","","Minigolf-Sport-Gemeinschaft Kempten e. V."]
[38133,"Sm 1","Jürgen","Tröller","SV Dreieichenhain","","","","","","","Sportverein 1890 e. V. Dreieichenhain Abteilung Bahnengolf"]
[63610,"Sm 1","Burkhard","Trümbach","MGC Bad Bocklet","","","","","","","Miniatur-Golf-Club \"Stahlquelle\", Bad Bocklet 1989 e. V."]
[40643,"Sm 2","Jürgen","Tschischka","MGC München","","","","","","","1. Miniaturgolfclub München-Feldmoching e. V."]
[67546,"Schm","Alan","Tuaew","SG Arheilgen","","","","","","","Sportgemeinschaft Arheilgen 1876/1945 e. V. Abteilung Bahnengolf"]
[67545,"Schw","Emilia","Tuaew","SG Arheilgen","","","","","","","Sportgemeinschaft Arheilgen 1876/1945 e. V. Abteilung Bahnengolf"]
[5739,"Sw 2","Erika","Tuchs","MGC Murnau","","","","","","","Minigolfclub Murnau am Staffelsee e. V."]
[66310,"H","Cedric Alexander","Türk","MSK Neheim-Hüsten","","","","","","","MINIGOLF-SPORT-KLUB Neheim-Hüsten e. V."]
[67742,"Jm","Tobias","Turner","BGSV Castrop","","","","","","","Bahnengolfsportverein Castrop e. V. 1961"]
[36173,"Sm 2","Uwe","Tusch","MGC Göttingen","Ja",14182,"X","","","","1. Miniatur-Golfsport-Club 1970 Göttingen e. V."]
[66441,"Sm 2","Heinrich","Uetzmann",{"$f":"VLOOKUP(L3266,Kurznamen,2,0)","v":"Tempelhofer MV"},{"$f":"IF(VLOOKUP(L3266,Kurznamen,3,0)=\"Ja\",\"Ja\",\"\")","v":""},"","","","","","Tempelhofer Miniaturgolf Verein von 1965 e. V."]
[34151,"D","Jasmin Astrid","Uhl","MGC Olympia Kiel","","","","","","","Miniaturgolfclub Olympia Kiel e. V."]
[30695,"Sw 1","Birgit","Uhl","MGC Olympia Kiel","","","","","","","Miniaturgolfclub Olympia Kiel e. V."]
[36133,"Sm 1","Thorsten","Uhlig","MSC München","","","","","","","Minigolf-Sport-Club blau-weiß 2003 e. V. München"]
[42068,"Sm 1","Thorsten","Uhlir","CGC Hamm","","","","","","","Cobigolf-Verein Hamm 2019 e. V."]
[47176,"Sm 2","Werner","Uhr","MSC Neu-Wulstorf","","","","","","","1. Minigolf-Sport-Club Hamburg-Neu-Wulmstorf e. V."]
[37956,"H","Dominik","Ullrich","MGC Mainz","","","","","","","Erster Mainzer Minigolf-Club e. V. 1964"]
[33761,"H","Stefan","Ulrich","MGC Ludwigshafen","","","","","","","1. Miniatur-Golf-Club Ludwigshafen 1964 e. V."]
[66988,"D","Miriam","Ulrich","MGC Ludwigshafen","","","","","","","1. Miniatur-Golf-Club Ludwigshafen 1964 e. V."]
[29919,"Sm 2","Uwe","Ulrich","BGC Goslar","Ja",9514,"","X","","","Bahnen-Golf-Club Goslar e. V."]
[45991,"Sm 1","Andreas","Umbach","MGC Kassel","Ja","","","","","","1. Mini-Golfsport-Club Kassel-Vellmar 1964 e. V."]
[38310,"H","Lukas","Umhauer","MGC Mainz","","","","","","","Erster Mainzer Minigolf-Club e. V. 1964"]
[2411,"Sm 2","Jens","Umhauer","MGC Mainz","","","","","","","Erster Mainzer Minigolf-Club e. V. 1964"]
[1322,"Sw 2","Karin","Umlauf","SC Bad Münder","Ja","","","","","","Sportclub Bad Münder e. V. Abteilung Bahnengolf"]
[34732,"Sm 1","Uwe","Ungermann","BSC Ennepetal","","","","","","","Bahngolf-Sport-Club Ennepetal e. V."]
[38216,"H","Thomas","Unglaube","BGC Dormagen","","","","","","","Bahnengolf-Club Dormagen e. V."]
[67170,"Sm 1","Joerg","Unruh","MGC Viernheim","","","","","","","MGC Millennium Viernheim e. V."]
[26698,"Sm 2","Horst","Unterleitner","CGC Illertal","","","","","","","Cobigolfclub Illertal Kellmünz e. V."]
[66186,"Jm","Dominic","Urban","MGC Witten","","","","","","","Minigolfclub \"AS\" Witten 1963 e. V."]
[35604,"Sm 1","Volker","Urban","MGC Witten","","","","","","","Minigolfclub \"AS\" Witten 1963 e. V."]
[35605,"Sw 1","Angela","Urban","MGC Witten","","","","","","","Minigolfclub \"AS\" Witten 1963 e. V."]
[30422,"H","Patrick","Urbanke","MGC Bad Soden","","","","","","","Miniaturgolfclub Bad Soden-Salmünster e. V."]
[41095,"Sm 1","Karsten","Urbanski","Essener CGC","","","","","","","1. Essener cobiGOLF - Club \"Blau-Gold\" e. V."]
[67803,"Sw 1","Jenny","Uschmann","BGSC Gladbeck","","","","","","","Bahnengolfsportclub \"Gut Schlag\" Gladbeck e. V."]
[23,"Sw 1","Monika","Vahle","MSK Neheim-Hüsten","","","","","","","MINIGOLF-SPORT-KLUB Neheim-Hüsten e. V."]
[67224,"Sw 1","Kerstin","Vallot","BSV Asslar","","","","","","","Bahnengolf-Sportverein Aßlar 1987 e. V."]
[33059,"H","Dirk","van der Wals","MGC Epe","","","","","","","1. Minigolfclub Epe 1978 e. V."]
[26404,"Sm 2","Wilfried","van der Wals","MGC Epe","","","","","","","1. Minigolfclub Epe 1978 e. V."]
[38505,"H","Tom","van Diejen","MSC Bensheim-Auerbach","","","","","","","Minigolf-Sport-Club Bensheim-Auerbach e. V."]
[38415,"H","Jan","van Eickelen","BGV Bergisch Land","","","","","","","Bahnengolf-Verein Bergisch Land 1962/63 e. V."]
[65919,"Sm 2","Ralf","van Eickelen","BGV Bergisch Land","","","","","","","Bahnengolf-Verein Bergisch Land 1962/63 e. V."]
[67579,"Sm 1","Remco","van Steenwijk","BGC Uerdingen","","","","","","","Bahnengolf-Club Uerdingen e. V."]
[36532,"H","Jan","van Vught","SG Arheilgen","","","","","","","Sportgemeinschaft Arheilgen 1876/1945 e. V. Abteilung Bahnengolf"]
[40558,"Sm 2","Peter","Vanselow","MGC Sulzfeld","","","","","","","Miniatur Golf Club Sulzfeld e. V."]
[66881,"Jw","Svenja","Vatter","MGC Ludwigshafen","","","","","","","1. Miniatur-Golf-Club Ludwigshafen 1964 e. V."]
[31256,"Sm 1","Bernd","Veit","MGC Wetzlar","","","","","","","Miniatur-Golf-Club Wetzlar e. V."]
[67124,"H","Alexander","Vellone","BGC Bad Nenndorf","Ja","","","","","","Bahnen-Golf-Club Bad Nenndorf e. V."]
[27127,"Sm 2","Nicolo","Vellone","BGC Bad Nenndorf","Ja","","","","","","Bahnen-Golf-Club Bad Nenndorf e. V."]
[48946,"Sm 2","Dirk","Vennemann","VfB Osnabrück","","","","","","","Verein für Bahnengolf Osnabrück von 1984 e. V."]
[65961,"Sm 2","Ralf","Vennemann","VfB Osnabrück","","","","","","","Verein für Bahnengolf Osnabrück von 1984 e. V."]
[67382,"Sm 1","Gerhard","Verges","MGC Ladenburg","","","","","","","1. Miniaturgolf-Club Ladenburg e. V."]
[29907,"Sm 1","Alfred","Verhoeven","BGC Dormagen","","","","","","","Bahnengolf-Club Dormagen e. V."]
[37766,"H","Julian","Vernaleken","MGC Bad Salzuflen","","","","","","","Minigolf-Club Bad Salzuflen e. V."]
[33945,"D","Renate","Vetter","MSC Bensheim-Auerbach","","","","","","","Minigolf-Sport-Club Bensheim-Auerbach e. V."]
[36659,"Sm 2","Peter","Vielhauer","MGC Epe","","","","","","","1. Minigolfclub Epe 1978 e. V."]
[36658,"Sw 2","Marieluise","Vielhauer","MGC Epe","","","","","","","1. Minigolfclub Epe 1978 e. V."]
[34501,"Sm 1","Ralf","Vittinghoff","MGC Ladenburg","","","","","","","1. Miniaturgolf-Club Ladenburg e. V."]
[5272,"Sm 2","Leonhard","Vocht","OMGC Imgolstadt","","","","","","","Oberbayerische Minigolf-Club Ingolstadt e. V."]
[67637,"Sm 1","Marc","Vogel","MGC Bergisch Gladbach","","","","","","","Minigolf-Club Bergisch Gladbach Gierath e. V."]
[282,"Sm 2","Klaus","Vogentanz","MGC Bamberg","","","","","","","1. Minigolfclub Bamberg e. V."]
[44676,"Sm 1","Markus","Vogt","BGC Paffendorf","","","","","","","Bahnengolf Club Schloß Paffendorf e. V."]
[47299,"Sm 1","Michael","Vogt","MGC Dormagen-Brechten","","","","","","","Minigolfclub Dormagen - Brechten e. V."]
[5959,"Sm 2","Johannes","Völk","MGC Murnau","","","","","","","Minigolfclub Murnau am Staffelsee e. V."]
[24417,"Sm 2","Erhard","Völkel","NMC Kelheim","","","","","","","1. Niederbayerischer Minigolf-Club Kelheim e. V."]
[47134,"Sm 1","Michael","Volkmer","BV Sennestadt","","","","","","","BV Sennestadt e. V."]
[47133,"Sw 1","Iris","Volkmer-Ruben","BV Sennestadt","","","","","","","BV Sennestadt e. V."]
[43224,"Sm 2","Jürgen","Vollmer","BGC Paderborn","","","","","","","1. Bahnengolfclub Paderborn e. V."]
[66544,"D","Anja","Vollrath","MGC Bad Homburg","","","","","","","Minigolf-Club Bad Homburg e. V."]
[37329,"Sm 1","Frank","Völzke","KGC Mönchengladbach","","","","","","","1. Klein-Golf-Club Mönchengladbach e. V."]
[37670,"Sm 1","Peter","vom Berg","BGC Paffendorf","","","","","","","Bahnengolf Club Schloß Paffendorf e. V."]
[34494,"H","Felix","vom Bruch","MSK Neheim-Hüsten","","","","","","","MINIGOLF-SPORT-KLUB Neheim-Hüsten e. V."]
[261,"Sm 1","Lars","Vomhof","MSK Neheim-Hüsten","","","","","","","MINIGOLF-SPORT-KLUB Neheim-Hüsten e. V."]
[49943,"H","Kay","von Beuningen","VfL Lohbrügge","","","","","","","Verein für Leibesübungen Lohbrügge von 1892 e. V. Abteilung Bahnengolf"]
[5612,"Sm 2","Boto","von Beuningen","VfL Lohbrügge","","","","","","","Verein für Leibesübungen Lohbrügge von 1892 e. V. Abteilung Bahnengolf"]
[2320,"Sw 2","Dörthe","von Beuningen",{"$f":"VLOOKUP(L3330,Kurznamen,2,0)","v":"VfL Lohbrügge"},{"$f":"IF(VLOOKUP(L3330,Kurznamen,3,0)=\"Ja\",\"Ja\",\"\")","v":""},"","","","","","Verein für Leibesübungen Lohbrügge von 1892 e. V. Abteilung Bahnengolf"]
[32379,"H","Sebastian","von Block","MSC Bad Godesberg","","","","","","","Minigolf-Sport-Club Bad Godesberg e. V."]
[46295,"Sw 2","Gabriele","von Contzen","SV Lurup","","","","","","","Sportverein Lurup-Hamburg von 1923 e. V. Abteilung Bahnengolf"]
[25562,"Sm 1","Andreas","von dem Knesebeck","MGC Göttingen","Ja",7552,"","X","","X","1. Miniatur-Golfsport-Club 1970 Göttingen e. V."]
[36691,"Sw 1","Alexandra","von dem Knesebeck","MGC Göttingen","Ja",14700,"","X","","","1. Miniatur-Golfsport-Club 1970 Göttingen e. V."]
[5288,"Sm 2","Ingo","von dem Knesebeck","MGC Göttingen","Ja",4489,"","X","","X","1. Miniatur-Golfsport-Club 1970 Göttingen e. V."]
[40235,"Sm 1","Stephan","von der Pütten","MGC Traben-Trarbach","","","","","","","Minigolfclub Traben-Trarbach e. V."]
[14562,"Sm 1","Axel","von Holten","MC Möve Cuxhaven","Ja",26119,"X","","","","Miniaturgolf-Club \"Möve\" Cuxhaven-Sahlenburg e. V."]
[66751,"Sm 1","Jens","von Trümbach","MGC Karlshagen","","","","","","","Minigolfclub Karlshagen e. V."]
[66750,"Sw 1","Katarzyna","von Trümbach","MGC Karlshagen","","","","","","","Minigolfclub Karlshagen e. V."]
[34068,"H","Waldemar","Voos","BGV Bergisch Land","","","","","","","Bahnengolf-Verein Bergisch Land 1962/63 e. V."]
[3720,"Sm 2","Hans-Peter","Vosberg","MGU Neviges","","","","","","","Minigolfunion Neviges-Odenthal 1968 e. V."]
[66768,"H","Christian","Voß","MGC Paderborn","","","","","","","1. Minigolf-Club Paderborn 1980 e. V."]
[49854,"Sm 1","Björn","Voß","MC Elmshorn","","","","","","","Minigolf-Club Flora Elmshorn e. V."]
[18217,"Sm 2","Fritz","Voss","CGC Hamm","","","","","","","Cobigolf-Verein Hamm 2019 e. V."]
[30196,"Sm 2","Johannes","Vosschulte","CGC Hamm","","","","","","","Cobigolf-Verein Hamm 2019 e. V."]
[65283,"H","Manuel André","Wächter","MSK Neheim-Hüsten","","","","","","","MINIGOLF-SPORT-KLUB Neheim-Hüsten e. V."]
[35127,"Sm 1","Sven","Wachtl","MGC Bad Homburg","","","","","","","Minigolf-Club Bad Homburg e. V."]
[4260,"Sw 2","Renate","Wachtl","MGC Bad Homburg","","","","","","","Minigolf-Club Bad Homburg e. V."]
[5997,"Sw 2","Gertrud","Wäcke","MGC Bad Bocklet","","","","","","","Miniatur-Golf-Club \"Stahlquelle\", Bad Bocklet 1989 e. V."]
[26331,"Sm 2","Hans Rolf","Wageck","MGC Ludwigshafen","","","","","","","1. Miniatur-Golf-Club Ludwigshafen 1964 e. V."]
[37142,"Sm 2","Uwe","Wageck","BGV Rodalben","","","","","","","1. Bahnengolfverein Rodalben 1977 e. V."]
[67083,"Schm","Tobias","Wagener","MGC Murnau","","","","","","","Minigolfclub Murnau am Staffelsee e. V."]
[66313,"Sm 1","Volker","Wagener","MGC Murnau","","","","","","","Minigolfclub Murnau am Staffelsee e. V."]
[45065,"H","Jürgen","Wagner","MC Schriesheim","","","","","","","Miniaturgolf Sportclub Schriesheim e. V."]
[50472,"H","Christian","Wagner","PTSV Hof","","","","","","","Post- und Telekom-Sportverein Hof e. V. Abteilung Minigolf "]
[28224,"D","Imke","Wagner","MC Schriesheim","","","","","","","Miniaturgolf Sportclub Schriesheim e. V."]
[67393,"Jm","Ben","Wagner","VfM Bottrop","","","","","","","Verein für Minigolf Bottrop e. V."]
[4908,"Sm 2","Franz","Wagner","KC Homburg","","","","","","","1. Kleingolf Club Homburg-Saar 1967 e. V."]
[5805,"Sm 2","Günter","Wagner","MSC Herscheid","","","","","","","Minigolf-Sportclub Herscheid 1963 e. V."]
[26716,"Sm 2","Hans-Joachim","Wagner","MGC Mainz","","","","","","","Erster Mainzer Minigolf-Club e. V. 1964"]
[61252,"Sm 2","Gerald","Wagner","MGC Würzburg","","","","","","","Miniaturgolfsportverein Würzburg - Löwenbrücke e. V."]
[4906,"Sw 2","Barbara","Wagner","KC Homburg","","","","","","","1. Kleingolf Club Homburg-Saar 1967 e. V."]
[36583,"Sw 2","Marita","Wagner","MSC Herscheid","","","","","","","Minigolf-Sportclub Herscheid 1963 e. V."]
[30067,"D","Sandra","Waldherr","MGC Wertheim","","","","","","","Minigolfdub Wertheim ´91 e. V."]
[43576,"Sm 1","Udo","Waldmann","BGC Landshut","","","","","","","1. Bahnengolf-Club Landshut e. V."]
[36560,"H","Marcel","Waleska","MGC Göttingen","Ja","","","","","","1. Miniatur-Golfsport-Club 1970 Göttingen e. V."]
[1185,"Sw 2","Ingrit","Walkowiak","TSV Salzgitter","Ja","","","","","","Turn- und Sportverein Salzgitter e. V. Abteilung Bahnengolf"]
[67799,"Sm 1","Peter","Wallbaum","MGC Wanne-Eickel","","","","","","","Minigolfclub Rot-Weiß Wanne-Eickel e. V."]
[38081,"Sm 1","Volker","Wallenski","TSV Kücknitz","","","","","","","Turn - und Sportverein Kücknitz von 1911 e. V. Abteilung Bahnengolf"]
[38499,"H","Daniel","Wallich","BGC Bildstock","","","","","","","Bahnen-Golf-Club Bildstock e. V."]
[67547,"Sm 1","Fredrik","Wallin","NDE Miniaturgolf","","","","","","","Niendorfer Miniaturgolf-Club von 1963 e. V."]
[67663,"Jm","Jannick","Walter","MGC Lohfelden","Ja","","","","","","1. Miniatur-Golfsport-Club Lohfelden e. V."]
[24779,"Sm 2","Udo","Walter","VfM Bottrop","","","","","","","Verein für Minigolf Bottrop e. V."]
[38457,"H","Denis","Walther","MGC Karlshagen","","","","","","","Minigolfclub Karlshagen e. V."]
[66125,"H","Markus","Walther","MGC Karlshagen","","","","","","","Minigolfclub Karlshagen e. V."]
[28026,"Sm 1","Klaus","Walther","BGC Rheinau-Freistett","","","","","","","BGC Rheinau-Freistett e. V."]
[36712,"Sm 2","Hans-Jürgen","Walther","BGC Essen","","","","","","","Bahnengolf - Club Assindia Essen e. V."]
[40495,"Sm 1","Christian","Wamboldt","MSK Olching","","","","","","","Olchinger Minigolf Sport Klub e. V."]
[29768,"Sw 1","Christiane","Wamboldt","MSK Olching","","","","","","","Olchinger Minigolf Sport Klub e. V."]
[66192,"Jm","Eric","Wanjek","BGSC Gladbeck","","","","","","","Bahnengolfsportclub \"Gut Schlag\" Gladbeck e. V."]
[37030,"Sm 1","Guido","Wanjek","BGSC Gladbeck","","","","","","","Bahnengolfsportclub \"Gut Schlag\" Gladbeck e. V."]
[37029,"Sw 1","Mandy","Wanjek","BGSC Gladbeck","","","","","","","Bahnengolfsportclub \"Gut Schlag\" Gladbeck e. V."]
[36782,"H","Alexander","Wanner","MGC Metzingen","","","","","","","1. Miniaturgolf Club Metzingen e. V."]
[33946,"Sm 1","Burkhard","Waptis","BGSV Castrop","","","","","","","Bahnengolfsportverein Castrop e. V. 1961"]
[66830,"Jm","Silas","Warkentin","TSV Pfungstadt","","","","","","","TSV Pfungstadt e. V. Abteilung Bahnengolf"]
[1612,"Sw 1","Jenifer","Warnecke","BGC Wolfsburg","Ja","","","","","","1. Bahnen - Golf - Club Wolfsburg e. V."]
[46911,"Sw 1","Nicole","Warnecke","BGC Wolfsburg","Ja",20060,"","X","","","1. Bahnen - Golf - Club Wolfsburg e. V."]
[35214,"Sm 2","Thomas","Warnkens","BGC Bremen","Ja","","","","","","Bahnen-Golf-Club Bremen e. V."]
[65415,"H","Tobias","Warschkau","SC Wermelskirchen","","","","","","","SC-Wermelskirchen e. V."]
[24559,"Sm 2","Hans-Werner","Waschbusch","FZC Bliesen","","","","","","","Freizeit Club Bliesen e. V."]
[43441,"Sw 2","Ursula","Waschbusch","FZC Bliesen","","","","","","","Freizeit Club Bliesen e. V."]
[67427,"Sm 1","Michael","Wassberg","MGC Bad Homburg","","","","","","","Minigolf-Club Bad Homburg e. V."]
[34515,"H","Sven","Wassermann","MGC Kassel","Ja",12618,"","X","","","1. Mini-Golfsport-Club Kassel-Vellmar 1964 e. V."]
[37371,"Sm 2","Peter","Waßmer",{"$f":"VLOOKUP(L3394,Kurznamen,2,0)","v":"BSV Inzlingen"},{"$f":"IF(VLOOKUP(L3394,Kurznamen,3,0)=\"Ja\",\"Ja\",\"\")","v":""},"","","","","","Bahnengolf-Sportverein Inzlingen 1979 e. V."]
[65513,"Sw 2","Brigitte","Waßmer","BSV Inzlingen","","","","","","","Bahnengolf-Sportverein Inzlingen 1979 e. V."]
[65861,"H","Sven","Waxmann","MGC Traben-Trarbach","","","","","","","Minigolfclub Traben-Trarbach e. V."]
[65862,"H","Dirk","Waxmann","MGC Traben-Trarbach","","","","","","","Minigolfclub Traben-Trarbach e. V."]
[23179,"H","Dennis","Weber","Rot-Weiß Syburg","","","","","","","Rot-Weiß Syburg 1960 e. V."]
[27911,"H","Dominik","Weber","CGC Hamm","","","","","","","Cobigolf-Verein Hamm 2019 e. V."]
[66802,"H","Marco","Weber","MC Schriesheim","","","","","","","Miniaturgolf Sportclub Schriesheim e. V."]
[66765,"Jw","Elena","Weber","MGC Murnau","","","","","","","Minigolfclub Murnau am Staffelsee e. V."]
[66887,"Jw","Janina","Weber","MSC Bad Godesberg","","","","","","","Minigolf-Sport-Club Bad Godesberg e. V."]
[29622,"Sm 1","Hans-Dieter","Weber","MSC Bad Godesberg","","","","","","","Minigolf-Sport-Club Bad Godesberg e. V."]
[6298,"Sm 2","Karl-Otto","Weber","BGC Bad Mergentheim","","","","","","","Bahnen-Golf-Club Bad Mergentheim e. V."]
[35116,"Sm 2","Bernd","Weber","VfM Bottrop","","","","","","","Verein für Minigolf Bottrop e. V."]
[38167,"Sw 2","Marianne","Weber","BGC Bad Mergentheim","","","","","","","Bahnen-Golf-Club Bad Mergentheim e. V."]
[66866,"Sw 2","Jutta","Weber","BGC Landshut","","","","","","","1. Bahnengolf-Club Landshut e. V."]
[67787,"Sw 1","Carmen","Wedel","BSV Bad Homburg","","","","","","","Bahnengolf-Sportverein Bad Homburg v.d.H. e. V."]
[46606,"Sm 1","Sven","Wedmann","BGC Bad Nenndorf","Ja",19881,"","X","","X","Bahnen-Golf-Club Bad Nenndorf e. V."]
[35491,"Sm 1","Frank","Wege","BGV Backumer Tal","","","","","","","BGV Backumer Tal Herten e. V."]
[33976,"Sm 2","Hugo","Wehlmann","MGC Sulzfeld","","","","","","","Miniatur Golf Club Sulzfeld e. V."]
[50935,"Sm 1","Markus","Wehmeyer","MGC Epe","","","","","","","1. Minigolfclub Epe 1978 e. V."]
[37139,"Sm 2","Dieter","Wehn","MGC Bad Bocklet","","","","","","","Miniatur-Golf-Club \"Stahlquelle\", Bad Bocklet 1989 e. V."]
[37133,"D","Svenja","Wehner","HMC Büttgen","","","","","","","Hobbysport Miniaturgolfclub Büttgen e. V."]
[31003,"Sm 1","Uwe","Wehner","VfM Berlin","","","","","","","Verein für Minigolf e. V. Berlin"]
[66720,"Sw 1","Petra","Wehner","VfM Berlin","","","","","","","Verein für Minigolf e. V. Berlin"]
[27861,"Sm 2","Thomas","Wehner","HMC Büttgen","","","","","","","Hobbysport Miniaturgolfclub Büttgen e. V."]
[37252,"Sw 2","Martina","Wehner","HMC Büttgen","","","","","","","Hobbysport Miniaturgolfclub Büttgen e. V."]
[67384,"Sm 1","Christofer","Wehrheim","MGC Bad Homburg","","","","","","","Minigolf-Club Bad Homburg e. V."]
[35645,"Sm 1","Thorsten","Wehrmann","MGC Bad Salzuflen","","","","","","","Minigolf-Club Bad Salzuflen e. V."]
[44007,"Sw 1","Petra","Weibbrecht","FMGC Lichtenfels","","","","","","","1. Fränkischer Minigolfclub Lichtenfels 1961 e. V."]
[67647,"H","Julian","Weibold","OMGC Imgolstadt","","","","","","","Oberbayerische Minigolf-Club Ingolstadt e. V."]
[34707,"D","Corina","Weickl","BGC Neutraubling","","","","","","","Bahnengolf-Club Neutraubling e. V."]
[51729,"H","Andreas","Weidel","BGC Neutraubling","","","","","","","Bahnengolf-Club Neutraubling e. V."]
[34555,"Sm 2","Bernhard","Weidemann","TSV Kücknitz","","","","","","","Turn - und Sportverein Kücknitz von 1911 e. V. Abteilung Bahnengolf"]
[32995,"H","Stefan","Weidl","MSG Kempten","","","","","","","Minigolf-Sport-Gemeinschaft Kempten e. V."]
[44689,"Sm 1","Ingo","Weidner","BGC Hannover","Ja",18682,"","","","X","1. Bahnen-Golf-Club Hannover e. V."]
[6605,"Sm 2","Klaus-Dieter","Weigang","BGC Hannover","Ja",5025,"X","","","","1. Bahnen-Golf-Club Hannover e. V."]
[38019,"Sm 2","Karlheinz","Weigenand","MC Ilvesheim","","","","","","","Miniaturgolf-Club Ilvesheim e. V."]
[41248,"Sm 1","Christian","Weigl","BSV Inzlingen","","","","","","","Bahnengolf-Sportverein Inzlingen 1979 e. V."]
[67071,"Jm","Dominik","Weihs","MSK Neheim-Hüsten","","","","","","","MINIGOLF-SPORT-KLUB Neheim-Hüsten e. V."]
[26955,"Sm 1","Reiner","Weinberger","BGC Neutraubling","","","","","","","Bahnengolf-Club Neutraubling e. V."]
[36154,"Sm 2","Reinhold","Weinberger","MC Gelsenkirchen","","","","","","","1. Minigolf Club Gelsenkirchen e. V."]
[3488,"Sw 2","Inge","Weinberger","BGC Neutraubling","","","","","","","Bahnengolf-Club Neutraubling e. V."]
[36153,"Sw 2","Sabine","Weinberger","MC Gelsenkirchen","","","","","","","1. Minigolf Club Gelsenkirchen e. V."]
[35538,"H","Stefan","Weinhold","ASV Pegnitz","","","","","","","Allgemeiner Sportverein Pegnitz e. V. Abteilung Minigolf"]
[62043,"Sw 2","Helga","Weinstein","KGC Frankfurt","","","","","","","Kleingolfclub Waldstadion e. V. Frankfurt am Main\t"]
[36594,"D","Claudia","Weinzierl","NMC Kelheim","","","","","","","1. Niederbayerischer Minigolf-Club Kelheim e. V."]
[41137,"Sm 1","Jörg","Weirich","MSC Bensheim-Auerbach","","","","","","","Minigolf-Sport-Club Bensheim-Auerbach e. V."]
[35006,"Sm 1","Ralf","Weis","Münchener MC","","","","","","","1. Münchener Minigolf-Club 1962 e. V."]
[17988,"Sm 2","Norbert","Weis","BGC Schweinfurt","","","","","","","Bahnengolfclub Schweinfurt e. V."]
[48289,"Sw 1","Silvia","Weiser","MGC Murnau","","","","","","","Minigolfclub Murnau am Staffelsee e. V."]
[9244,"Sm 2","Wolfgang","Weiser","TSV Pfungstadt","","","","","","","TSV Pfungstadt e. V. Abteilung Bahnengolf"]
[48288,"Sm 2","Franz","Weiser","MGC Murnau","","","","","","","Minigolfclub Murnau am Staffelsee e. V."]
[38114,"H","Steven","Weiß","MGC Mainz","","","","","","","Erster Mainzer Minigolf-Club e. V. 1964"]
[66719,"Jm","Christian","Weiß","TV Niederstetten","","","","","","","Turnverein Niederstetten 1862 e. V. Abteilung Minigolf"]
[67276,"Schm","Damon","Weiß","MC Schriesheim","","","","","","","Miniaturgolf Sportclub Schriesheim e. V."]
[36070,"Sm 1","Rolf","Weiß","TV Niederstetten","","","","","","","Turnverein Niederstetten 1862 e. V. Abteilung Minigolf"]
[38113,"Sm 1","Michael","Weiß","MC Schriesheim","","","","","","","Miniaturgolf Sportclub Schriesheim e. V."]
[38112,"Sw 1","Jeannette","Weiß","MC Schriesheim","","","","","","","Miniaturgolf Sportclub Schriesheim e. V."]
[44173,"Sm 1","Stefan","Weißenberger","TG Höchberg","","","","","","","Turngemeinde Höchberg von 1862 Bahnengolf e. V."]
[30307,"D","Angela","Weißer","BIG Ingelfingen","","","","","","","Bahnengolf Interessen-Gemeinschaft Ingelfingen 2020 e. V."]
[35784,"Sm 1","Stephan","Weißer","BIG Ingelfingen","","","","","","","Bahnengolf Interessen-Gemeinschaft Ingelfingen 2020 e. V."]
[67795,"Sw 1","Andrea","Weisser","MC Möve Cuxhaven","Ja","","","","","","Miniaturgolf-Club \"Möve\" Cuxhaven-Sahlenburg e. V."]
[33604,"H","Henning","Weißmann","MGC Göttingen","Ja","","","","","","1. Miniatur-Golfsport-Club 1970 Göttingen e. V."]
[34150,"H","Dennis","Welpmann","MC Künsebeck","","","","","","","Miniaturgolf Club Tigers Künsebeck e. V."]
[37781,"H","Patrick","Welpmann","MC Künsebeck","","","","","","","Miniaturgolf Club Tigers Künsebeck e. V."]
[67580,"Sw 1","Daniela","Welz",{"$f":"VLOOKUP(L3458,Kurznamen,2,0)","v":"MGC Wanne-Eickel"},{"$f":"IF(VLOOKUP(L3458,Kurznamen,3,0)=\"Ja\",\"Ja\",\"\")","v":""},"","","","","","Minigolfclub Rot-Weiß Wanne-Eickel e. V."]
[67014,"Sm 1","Ralf","Wendland","CGC Grötzingen","","","","","","","COBI-GOLF-CLUB Blau-Gelb Grötzingen 1968 e. V."]
[49256,"Sm 2","Dieter","Wendlandt","MC Möve Cuxhaven","Ja","","","","","","Miniaturgolf-Club \"Möve\" Cuxhaven-Sahlenburg e. V."]
[66014,"Sw 2","Elfi","Wendt","BGC Illertissen","","","","","","","Bahnengolfclub Illertissen e. V."]
[35896,"Sw 1","Gottholde","Weniger","CGC Rauschenberg","","","","","","","Cobigolf-Club Rauschenberg e. V."]
[66225,"H","Timo","Wenner","CGC Grötzingen","","","","","","","COBI-GOLF-CLUB Blau-Gelb Grötzingen 1968 e. V."]
[37916,"H","Marcel","Wentzel","VfL Lohbrügge","","","","","","","Verein für Leibesübungen Lohbrügge von 1892 e. V. Abteilung Bahnengolf"]
[37949,"H","Dominik","Wentzel","MGC Bad Oldesloe","","","","","","","Miniaturgolfclub Bad Oldesloe von 1964 e. V."]
[31459,"H","Felix","Wenz","BGSV Kerpen","","","","","","","Bahnen-Golf-Sport-Vereinigung Kerpen e. V."]
[32089,"H","Tobias","Wenz","BGSV Kerpen","","","","","","","Bahnen-Golf-Sport-Vereinigung Kerpen e. V."]
[42436,"Sm 2","Detlef","Wenzel","BGV Backumer Tal","","","","","","","BGV Backumer Tal Herten e. V."]
[66221,"Sm 2","Norbert","Wenzel","BGC Hannover","Ja","","","","","","1. Bahnen-Golf-Club Hannover e. V."]
[5994,"Sm 2","Karl","Wenzke","MGC Bad Bocklet","","","","","","","Miniatur-Golf-Club \"Stahlquelle\", Bad Bocklet 1989 e. V."]
[35061,"H","Ulrich","Wernecke","MGC Bad Oldesloe","","","","","","","Miniaturgolfclub Bad Oldesloe von 1964 e. V."]
[37605,"Sm 2","Uwe","Wernecke","MGC Bad Oldesloe","","","","","","","Miniaturgolfclub Bad Oldesloe von 1964 e. V."]
[36311,"H","Lars","Werner","MGC Biebertal","","","","","","","Miniatur-Golf-Club Freizeitzentrum Biebertal e. V."]
[37386,"D","Simone","Werner","MGC Murnau","","","","","","","Minigolfclub Murnau am Staffelsee e. V."]
[31120,"Sm 1","Hans Jürgen","Werner","MSC Bensheim-Auerbach","","","","","","","Minigolf-Sport-Club Bensheim-Auerbach e. V."]
[35666,"D","Jana","Wernicke","BGC Neutraubling","","","","","","","Bahnengolf-Club Neutraubling e. V."]
[28786,"Sm 2","Karlheinz","Werres","KGC Mönchengladbach","","","","","","","1. Klein-Golf-Club Mönchengladbach e. V."]
[35546,"H","Florian","Wesemann","BGC Diepholz","Ja",13646,"","","","X","Bahnen-Golf-Club Diepholz e. V."]
[36292,"H","Eike-Fabian","Wesemann","BGC Diepholz","Ja","","","","","","Bahnen-Golf-Club Diepholz e. V."]
[50388,"H","Christoph","Wess","MGC putter Künzell","","","","","","","Minigolfclub putter Künzell 1970 e. V."]
[43598,"Sm 1","Volker","Wesselmäcking","TSV Salzgitter","Ja","","","","","","Turn- und Sportverein Salzgitter e. V. Abteilung Bahnengolf"]
[37466,"Sm 2","Klaus","Wessendorf","MGC Georgsmarienhütte","","","","","","","Minigolf-Club Georgsmarienhütte e. V."]
[67407,"D","Stefanie","Westerwelle","VfB Osnabrück","","","","","","","Verein für Bahnengolf Osnabrück von 1984 e. V."]
[66696,"Sm 2","Rainer","Wettstädt","MV Lankwitzer Dragons","","","","","","","MV Lankwitzer Dragons e. V."]
[37659,"H","Jonas","Wetzel","BGC Dormagen","","","","","","","Bahnengolf-Club Dormagen e. V."]
[31721,"Sm 1","Klaus","Wetzel","BGC Dormagen","","","","","","","Bahnengolf-Club Dormagen e. V."]
[42610,"Sm 1","Markus","Wetzel","BGC Dormagen","","","","","","","Bahnengolf-Club Dormagen e. V."]
[31216,"Sw 1","Cornelia","Wetzel","CGC Grötzingen","","","","","","","COBI-GOLF-CLUB Blau-Gelb Grötzingen 1968 e. V."]
[5581,"Sm 2","Paul","Wetzel","MGC Süßen","","","","","","","1. Miniaturgolfclub Süßen e. V."]
[3309,"Sm 2","Christian","Weyandt","SSV Ulm","","","","","","","Schwimm- und Sportverein Ulm 1846 e. V. Abteilung Bahnengolf"]
[46965,"Sm 1","Stefan","Weyers","BGC Uerdingen","","","","","","","Bahnengolf-Club Uerdingen e. V."]
[29149,"Sm 1","Frank","Weygold","MGC Ladenburg","","","","","","","1. Miniaturgolf-Club Ladenburg e. V."]
[27809,"Sm 1","Thomas","Weygoldt","MGC Ladenburg","","","","","","","1. Miniaturgolf-Club Ladenburg e. V."]
[43497,"Sm 1","Marcus","Wiche","MSC Bad Godesberg","","","","","","","Minigolf-Sport-Club Bad Godesberg e. V."]
[3808,"Sm 2","Peter","Wichmann","NDE Miniaturgolf","","","","","","","Niendorfer Miniaturgolf-Club von 1963 e. V."]
[38324,"H","Daniel","Wick","MGC Traben-Trarbach","","","","","","","Minigolfclub Traben-Trarbach e. V."]
[30278,"Sm 2","Frank","Wickel","MGC Heven","","","","","","","Miniatur - Golf - Club Heven e. V."]
[33510,"D","Melanie","Wickel-Paffrath","MGC Heven","","","","","","","Miniatur - Golf - Club Heven e. V."]
[41894,"Sm 1","Bernd","Widera","BGC Wolfsburg","Ja","","","","","","1. Bahnen - Golf - Club Wolfsburg e. V."]
[47446,"H","Roland","Widmair","MGC Bad Feilnbach","","","","","","","Minigolfclub Bad Feilnbach e. V."]
[30082,"Sm 2","Peter","Widmair","MGC Bad Feilnbach","","","","","","","Minigolfclub Bad Feilnbach e. V."]
[37722,"Sm 2","Peter","Wiebauer","MGC Ludwigshafen","","","","","","","1. Miniatur-Golf-Club Ludwigshafen 1964 e. V."]
[65464,"Sw 2","Christine","Wiebauer","MGC Ludwigshafen","","","","","","","1. Miniatur-Golf-Club Ludwigshafen 1964 e. V."]
[32946,"Sm 2","Friedrich","Wiebusch","SC Wermelskirchen","","","","","","","SC-Wermelskirchen e. V."]
[38379,"Sm 2","Klaus-Heinrich","Wiedemann","VfM Berlin","","","","","","","Verein für Minigolf e. V. Berlin"]
[36603,"H","Oliver","Wieder","MGF Magdeburg","","","","","","","Minigolffreunde Magdeburg e. V."]
[33568,"Sm 1","Stephan","Wiedmann","SG Arheilgen","","","","","","","Sportgemeinschaft Arheilgen 1876/1945 e. V. Abteilung Bahnengolf"]
[34736,"Sm 1","Dieter","Wiedmann","TV Niederstetten","","","","","","","Turnverein Niederstetten 1862 e. V. Abteilung Minigolf"]
[1002,"Sm 2","Dieter","Wiegand","BGC Hannover","Ja","","","","","","1. Bahnen-Golf-Club Hannover e. V."]
[38058,"H","Florian","Wiegard","MGC putter Künzell","","","","","","","Minigolfclub putter Künzell 1970 e. V."]
[48335,"Sm 1","Michael","Wiegard","MGC putter Künzell","","","","","","","Minigolfclub putter Künzell 1970 e. V."]
[38061,"H","Marvin","Wiegel","Bochumer MC","","","","","","","Bochumer Minigolf-Club 1960 e. V."]
[4859,"Sm 2","Reinhold","Wiegelmann","RKV Rheinstetten","","","","","","","Rad- und Kraftfahrervereins \"Solidarität\" Mörsch e. V. Abteilung Minigolf Wölfe Rheinstetten 02"]
[67767,"Sw 1","Joy","Wielink-Pol","SC Dortmund","","","","","","","Sport-Club Olympia Dortmund e. V. "]
[42659,"Sw 1","Beate","Wiemer","TSV Pfungstadt","","","","","","","TSV Pfungstadt e. V. Abteilung Bahnengolf"]
[25211,"Sm 2","Thomas","Wiemer","MSC Bensheim-Auerbach","","","","","","","Minigolf-Sport-Club Bensheim-Auerbach e. V."]
[49980,"Sw 1","Ellen","Wienand","BGC Paderborn","","","","","","","1. Bahnengolfclub Paderborn e. V."]
[50367,"H","Thomas","Wiertz","MGC Bad Salzuflen","","","","","","","Minigolf-Club Bad Salzuflen e. V."]
[30856,"Sm 1","Lutz","Wierum","BGV Bergisch Land","","","","","","","Bahnengolf-Verein Bergisch Land 1962/63 e. V."]
[37893,"Sm 1","René","Wieser","HMC Büttgen","","","","","","","Hobbysport Miniaturgolfclub Büttgen e. V."]
[66667,"Jm","Julian","Wiesinger","MSK Olching","","","","","","","Olchinger Minigolf Sport Klub e. V."]
[66714,"Sm 1","Peter","Wiesinger",{"$f":"VLOOKUP(L3522,Kurznamen,2,0)","v":"MSK Olching"},{"$f":"IF(VLOOKUP(L3522,Kurznamen,3,0)=\"Ja\",\"Ja\",\"\")","v":""},"","","","","","Olchinger Minigolf Sport Klub e. V."]
[66730,"Sw 1","Nicole","Wiesinger","MSK Olching","","","","","","","Olchinger Minigolf Sport Klub e. V."]
[46031,"Sm 1","Florian","Wietz","NDE Miniaturgolf","","","","","","","Niendorfer Miniaturgolf-Club von 1963 e. V."]
[37443,"H","Sascha","Wilbrand","Rot-Weiß Syburg","","","","","","","Rot-Weiß Syburg 1960 e. V."]
[24312,"Sm 2","Dieter","Wild","MGC Süßen","","","","","","","1. Miniaturgolfclub Süßen e. V."]
[10721,"Sw 2","Annemarie","Wild","MGC Süßen","","","","","","","1. Miniaturgolfclub Süßen e. V."]
[29310,"Sm 2","Walter","Wildt","MGF Hammer","","","","","","","Minigolffreunde Hammer e. V."]
[4057,"Sm 2","Horst-Peter","Wilhelm","Reinickendorfer MGC","","","","","","","Reinickendorfer Miniatur - Golfsport - Club e. V."]
[66164,"D","Valerie","Wilhelms","BSC Ennepetal","","","","","","","Bahngolf-Sport-Club Ennepetal e. V."]
[44805,"Sm 1","Ralf","Wilhelms","BSC Ennepetal","","","","","","","Bahngolf-Sport-Club Ennepetal e. V."]
[46290,"Sw 1","Alexandra","Wilhelms","BSC Ennepetal","","","","","","","Bahngolf-Sport-Club Ennepetal e. V."]
[67627,"Jm","Henry Jeremy","Wilkes","BSC Ennepetal","","","","","","","Bahngolf-Sport-Club Ennepetal e. V."]
[3575,"Sm 2","Hans-Peter","Wilkesmann","BGC Dormagen","","","","","","","Bahnengolf-Club Dormagen e. V."]
[42431,"Sm 2","Jan","Wille","BGC Bochum","","","","","","","Bahnengolf-Sportclub Bochum 1978 e. V."]
[66006,"Sm 1","Michael","Willeke","MC Lüdenscheid","","","","","","","MC 62 Lüdenscheid e. V."]
[29879,"Sm 1","Marcus","Willems","BGC Weseling","","","","","","","1. Bahnen-Golf-Club Wesseling 1975 e. V. "]
[33849,"D","Anke","Willenbockel","MGC Karlshagen","","","","","","","Minigolfclub Karlshagen e. V."]
[29796,"Sw 2","Marion","Willenbockel","MC Möve Cuxhaven","Ja","","","","","","Miniaturgolf-Club \"Möve\" Cuxhaven-Sahlenburg e. V."]
[32333,"D","Melanie","Willfroth","CGC Hamm","","","","","","","Cobigolf-Verein Hamm 2019 e. V."]
[38004,"Sm 2","Lothar","Willkommen","TSV Arendsee","","","","","","","Turn- und Sportverein Arendsee e. V. Abteilung Minigolf"]
[66123,"H","Pascal","Willy","BSV Ohlsbach","","","","","","","Bahnengolfsportverein 82 Ohlsbach e. V."]
[37683,"D","Katrin","Wilms","CGC Bad Hamm","","","","","","","Cobigolf-Club \"Grün-Gold\" Bad Hamm e. V."]
[42963,"Sm 2","Joachim","Wilsch","HMC Büttgen","","","","","","","Hobbysport Miniaturgolfclub Büttgen e. V."]
[42964,"Sw 2","Petra","Wilsch","HMC Büttgen","","","","","","","Hobbysport Miniaturgolfclub Büttgen e. V."]
[33708,"Sw 2","Kirsten","Wimmer","MSC Bensheim-Auerbach","","","","","","","Minigolf-Sport-Club Bensheim-Auerbach e. V."]
[67649,"Sw 1","Beatrix","Windberg","MGF Magdeburg","","","","","","","Minigolffreunde Magdeburg e. V."]
[33926,"Sm 1","Andreas","Winkel","MGC Süßen","","","","","","","1. Miniaturgolfclub Süßen e. V."]
[36541,"Sm 1","Dirk","Winkler","BGSC Gladbeck","","","","","","","Bahnengolfsportclub \"Gut Schlag\" Gladbeck e. V."]
[38201,"H","Simon Leon","Winter","MGC Wetzlar","","","","","","","Miniatur-Golf-Club Wetzlar e. V."]
[67421,"H","Simon","Winter","PTSV Hof","","","","","","","Post- und Telekom-Sportverein Hof e. V. Abteilung Minigolf "]
[67797,"Sm 2","Roland","Winter","MGC Wanne-Eickel","","","","","","","Minigolfclub Rot-Weiß Wanne-Eickel e. V."]
[67796,"Sw 2","Elisabeth","Winter","MGC Wanne-Eickel","","","","","","","Minigolfclub Rot-Weiß Wanne-Eickel e. V."]
[67424,"Schw","Johanna","Winterhoff","BSC Ennepetal","","","","","","","Bahngolf-Sport-Club Ennepetal e. V."]
[45644,"Sm 1","Peter","Winters","BGSV Kerpen","","","","","","","Bahnen-Golf-Sport-Vereinigung Kerpen e. V."]
[37763,"Sm 1","Thorsten","Winzer","MGC Biebertal","","","","","","","Miniatur-Golf-Club Freizeitzentrum Biebertal e. V."]
[36520,"Sm 1","Toni","Wirbals","TSV Kücknitz","","","","","","","Turn - und Sportverein Kücknitz von 1911 e. V. Abteilung Bahnengolf"]
[25167,"Sm 2","Michael","Wirth","Duisburger MC","","","","","","","1. Duisburger Minigolf Club 1962 e. V."]
[32625,"H","Karsten","Wischeropp","MGF Magdeburg","","","","","","","Minigolffreunde Magdeburg e. V."]
[45007,"Sw 1","Birthe","Wischnath","MGC Bad Oldesloe","","","","","","","Miniaturgolfclub Bad Oldesloe von 1964 e. V."]
[67416,"Jm","Fynn","Wischott","MSK Neheim-Hüsten","","","","","","","MINIGOLF-SPORT-KLUB Neheim-Hüsten e. V."]
[34695,"H","Marc","Wisnewski","MSC Wesel","","","","","","","1. Minigolf-Sportclub Wesel 66 66 e. V. "]
[36971,"Sm 2","Thomas","Witte","Tempelhofer MV","","","","","","","Tempelhofer Miniaturgolf Verein von 1965 e. V."]
[41466,"Sm 1","Peter","Wittek","BGC Hannover","Ja","","","","","","1. Bahnen-Golf-Club Hannover e. V."]
[29626,"Sm 1","Andreas","Wittke","MGC Dormagen-Brechten","","","","","","","Minigolfclub Dormagen - Brechten e. V."]
[37992,"Sw 1","Helga","Wittkopf","BGC Bremen","Ja","","","","","","Bahnen-Golf-Club Bremen e. V."]
[67230,"H","Marcel","Wittling","Osnabrücker MC","","","","","","","Osnabrücker Minigolf Club von 1963 e. V."]
[67339,"Schw","Kiara","Wittling","Osnabrücker MC","","","","","","","Osnabrücker Minigolf Club von 1963 e. V."]
[33415,"H","Christian","Wittwer","MSV Bad Kreuznach","","","","","","","MSV Bad Kreuznach e. V."]
[33416,"H","Daniel","Wittwer","MSV Bad Kreuznach","","","","","","","MSV Bad Kreuznach e. V."]
[37964,"Sm 1","Joachim","Wodok","BGC Celle","Ja","","","","","","1. Bahnen-Golf-Club Celle von 1964 e. V."]
[35095,"Sw 2","Luise","Wohlfarth","MGC Würzburg","","","","","","","Miniaturgolfsportverein Würzburg - Löwenbrücke e. V."]
[67757,"Sm 2","Michael","Wohlgemuth","BGC Oberhausen","","","","","","","Bahnengolf-Club Oberhausen e. V."]
[67361,"Sm 1","Michael","Wöhrmann","BSV München","","","","","","","Bahnengolfsportverein 86 München e. V."]
[67362,"Sw 1","Tatjana","Wöhrmann","BSV München","","","","","","","Bahnengolfsportverein 86 München e. V."]
[35180,"D","Manuela","Wolf","SC Bastion Lippstadt","","","","","","","SC Bastion Rot - Weiß Lippstadt 1964 e. V."]
[35847,"D","Stefanie","Wolf","ASV Pegnitz","","","","","","","Allgemeiner Sportverein Pegnitz e. V. Abteilung Minigolf"]
[4639,"Sm 2","Henning","Wolf","BGC Northeim","Ja","","","","","","Bahnen-Golf-Club Northeim e. V."]
[4835,"Sm 2","Karl-Heinz","Wolf","SC Bastion Lippstadt","","","","","","","SC Bastion Rot - Weiß Lippstadt 1964 e. V."]
[66409,"Sm 2","Arnold","Wolf","SC Bastion Lippstadt","","","","","","","SC Bastion Rot - Weiß Lippstadt 1964 e. V."]
[40341,"H","Julian","Wolff","MC Lüdenscheid","","","","","","","MC 62 Lüdenscheid e. V."]
[66059,"Sm 1","Marko","Wolff","BGC Uerdingen","","","","","","","Bahnengolf-Club Uerdingen e. V."]
[548,"Sw 1","Beate","Wolff","BSV Ohlsbach","","","","","","","Bahnengolfsportverein 82 Ohlsbach e. V."]
[20690,"Sm 2","Bertram","Wolff","BSV Ohlsbach","","","","","","","Bahnengolfsportverein 82 Ohlsbach e. V."]
[66527,"Sm 2","Ulf-Michael","Wolff","BGC Hannover","Ja",28616,"X","","","X","1. Bahnen-Golf-Club Hannover e. V."]
[66940,"Sm 1","Stefan","Woller",{"$f":"VLOOKUP(L3586,Kurznamen,2,0)","v":"MC Gelsenkirchen"},{"$f":"IF(VLOOKUP(L3586,Kurznamen,3,0)=\"Ja\",\"Ja\",\"\")","v":""},"","","","","","1. Minigolf Club Gelsenkirchen e. V."]
[33461,"Sm 2","Fritz-Herbert","Woltmann","MC Möve Cuxhaven","Ja","","","","","","Miniaturgolf-Club \"Möve\" Cuxhaven-Sahlenburg e. V."]
[37276,"Sm 1","Martin","Wolyniak","SV Dreieichenhain","","","","","","","Sportverein 1890 e. V. Dreieichenhain Abteilung Bahnengolf"]
[66515,"Sm 1","Hans Joachim","Wonka","TSV Pfungstadt","","","","","","","TSV Pfungstadt e. V. Abteilung Bahnengolf"]
[38503,"D","Sonja","Wontroba","MSC Bad Godesberg","","","","","","","Minigolf-Sport-Club Bad Godesberg e. V."]
[20394,"Sm 2","Frank-Thomas","Wortmann","CGC Bad Hamm","","","","","","","Cobigolf-Club \"Grün-Gold\" Bad Hamm e. V."]
[67821,"D","Jennifer","Woßilat","BGV Backumer Tal","","","","","","","BGV Backumer Tal Herten e. V."]
[547,"Sm 1","Jörg","Wössner","BGSV Kerpen","","","","","","","Bahnen-Golf-Sport-Vereinigung Kerpen e. V."]
[66210,"Sm 2","Wolfgang","Wotzlawek","BGC Landshut","","","","","","","1. Bahnengolf-Club Landshut e. V."]
[10260,"Sm 2","Hans","Wriedt","MC Elmshorn","","","","","","","Minigolf-Club Flora Elmshorn e. V."]
[66919,"Sw 2","Susanne","Wriedt","MC Elmshorn","","","","","","","Minigolf-Club Flora Elmshorn e. V."]
[66408,"Sm 1","Wolfgang","Wruck","SC Bastion Lippstadt","","","","","","","SC Bastion Rot - Weiß Lippstadt 1964 e. V."]
[67036,"Sm 2","Dirk","Wulhorst","BGC Bad Nenndorf","Ja","","","","","","Bahnen-Golf-Club Bad Nenndorf e. V."]
[33821,"D","Gaby","Wunderlich","MSV Netphen","","","","","","","1. Minigolf-Sportverein Netphen e. V."]
[43556,"Sm 1","Mario","Wunderlich","SV Lurup","","","","","","","Sportverein Lurup-Hamburg von 1923 e. V. Abteilung Bahnengolf"]
[38072,"Sm 2","Günter","Wunderlich","MSV Netphen","","","","","","","1. Minigolf-Sportverein Netphen e. V."]
[66541,"Sm 1","Sascha Markus","Würges","BGC Kiel-West","","","","","","","Bahnen-Golf-Club Kiel-West e. V."]
[65922,"H","Jan","Würthle","BSV Ohlsbach","","","","","","","Bahnengolfsportverein 82 Ohlsbach e. V."]
[38504,"D","Michelle","Würthle","BSV Ohlsbach","","","","","","","Bahnengolfsportverein 82 Ohlsbach e. V."]
[44527,"Sm 1","Jürgen","Würthle","BSV Ohlsbach","","","","","","","Bahnengolfsportverein 82 Ohlsbach e. V."]
[28259,"Sm 1","Christian","Wustrack","MC Möve Cuxhaven","Ja","","","","","","Miniaturgolf-Club \"Möve\" Cuxhaven-Sahlenburg e. V."]
[63375,"Sw 2","Elke","Wuttke","BGC Hannover","Ja","","","","","","1. Bahnen-Golf-Club Hannover e. V."]
[34420,"Sw 1","Angelika","Wycisk","BGC Leipzig","","","","","","","1. Bahnen Golf Club Leipzig e. V."]
[50593,"Sw 2","Bettina","Zabel","BGC Hannover","Ja",21544,"","X","","","1. Bahnen-Golf-Club Hannover e. V."]
[41670,"Sm 1","Michael","Zahner","KGC Bad Urach","","","","","","","Klein-Golf-Club Bad Urach e. V."]
[45917,"Sm 1","Jürgen","Zahner","KGC Bad Urach","","","","","","","Klein-Golf-Club Bad Urach e. V."]
[4495,"Sm 2","Klaus","Zamponi","MSV Netphen","","","","","","","1. Minigolf-Sportverein Netphen e. V."]
[67568,"H","Max","Zander","MGC Bad Homburg","","","","","","","Minigolf-Club Bad Homburg e. V."]
[30058,"Sm 2","Hilmer","Zander","SG Weiterstadt","","","","","","","Sportgemeinde 1886 e. V. Weiterstadt Abteilung Bahnengolf"]
[37272,"H","Michel","Zazzi","Essener CGC","","","","","","","1. Essener cobiGOLF - Club \"Blau-Gold\" e. V."]
[35402,"Sm 1","Thorsten","Zazzi","Essener CGC","","","","","","","1. Essener cobiGOLF - Club \"Blau-Gold\" e. V."]
[38261,"Sm 2","Johann","Zech","BGC Singen","","","","","","","1. Bahnengolf-Club Singen e. V."]
[67690,"Sm 1","Andreas","Zeferer","BGC Bildstock","","","","","","","Bahnen-Golf-Club Bildstock e. V."]
[45973,"Sm 1","Michael","Zehe","MGC Ostheim/Rhön","","","","","","","Miniaturgolfclub Ostheim/Rhön e. V. "]
[22825,"Sm 2","Alfred","Zehm","SC Bastion Lippstadt","","","","","","","SC Bastion Rot - Weiß Lippstadt 1964 e. V."]
[66668,"Sw 2","Ingrid","Zehm","SC Bastion Lippstadt","","","","","","","SC Bastion Rot - Weiß Lippstadt 1964 e. V."]
[60359,"Sw 2","Emma","Zehtner","BSV München","","","","","","","Bahnengolfsportverein 86 München e. V."]
[50152,"H","Torsten","Zeisler","SSC Halver","","","","","","","SSC Halver e. V."]
[4438,"Sm 2","Werner","Zeisler","SSC Halver","","","","","","","SSC Halver e. V."]
[47089,"Sm 2","Klaus","Zeisler","SSC Halver","","","","","","","SSC Halver e. V."]
[40499,"Sm 1","Bernd","Zeller","MSK Olching","","","","","","","Olchinger Minigolf Sport Klub e. V."]
[3569,"Sm 2","Gerd","Zeller","MSK Olching","","","","","","","Olchinger Minigolf Sport Klub e. V."]
[5676,"Sw 2","Edeltraud","Zeller","MSK Olching","","","","","","","Olchinger Minigolf Sport Klub e. V."]
[47417,"Sw 2","Monika","Zeller","MGC München","","","","","","","1. Miniaturgolfclub München-Feldmoching e. V."]
[46752,"Sm 1","Markus","Zender","MGC Bad Bodendorf","","","","","","","Miniaturgolfclub Bad Bodendorf e. V."]
[31736,"Sm 2","Helmut","Zender","MGC Bergisch Gladbach","","","","","","","Minigolf-Club Bergisch Gladbach Gierath e. V."]
[18151,"Sm 2","Heinz","Zideller","BGC Bochum","","","","","","","Bahnengolf-Sportclub Bochum 1978 e. V."]
[6175,"Sm 2","Klaus","Ziebell","Tempelhofer MV","","","","","","","Tempelhofer Miniaturgolf Verein von 1965 e. V."]
[36994,"H","Frank","Ziegler","TG Höchberg","","","","","","","Turngemeinde Höchberg von 1862 Bahnengolf e. V."]
[38485,"H","Thomas","Ziegler","BGSV Kerpen","","","","","","","Bahnen-Golf-Sport-Vereinigung Kerpen e. V."]
[66330,"Sm 1","Andreas","Ziegler","MSK Olching","","","","","","","Olchinger Minigolf Sport Klub e. V."]
[66643,"Sm 1","Uwe","Ziegler","MGC Bad Bocklet","","","","","","","Miniatur-Golf-Club \"Stahlquelle\", Bad Bocklet 1989 e. V."]
[36995,"Sm 2","Roland","Ziegler","MGV Ansbach","","","","","","","MGV Ansbach e. V."]
[67543,"Sm 2","Rüdiger","Ziel","MC Rheinhausen","","","","","","","1. Minigolf-Club Rheinhausen e. V."]
[67542,"Sw 2","Ute","Ziel","MC Rheinhausen","","","","","","","1. Minigolf-Club Rheinhausen e. V."]
[38205,"H","Christian","Zielaff","MGC Göttingen","Ja","","","","","","1. Miniatur-Golfsport-Club 1970 Göttingen e. V."]
[33643,"Sm 1","Robert","Zierl","MGC Wertheim","","","","","","","Minigolfdub Wertheim ´91 e. V."]
[35462,"Sw 2","Sabine","Zierl","MGC Wertheim","","","","","","","Minigolfdub Wertheim ´91 e. V."]
[36344,"H","Lukas","Zimmermann","BGC Heilbronn","","","","","","","Bahnengolf Club Heilbronn e. V."]
[67698,"D","Ariane","Zimmermann","MGC Mainz","","","","","","","Erster Mainzer Minigolf-Club e. V. 1964"]
[67740,"Schw","Rebekka","Zimmermann","MGC Mainz","","","","","","","Erster Mainzer Minigolf-Club e. V. 1964"]
[67699,"Sm 1","Frank","Zimmermann","MGC Mainz","","","","","","","Erster Mainzer Minigolf-Club e. V. 1964"]
[66463,"Sm 2","Dieter","Zimmermann","BGC Paderborn","","","","","","","1. Bahnengolfclub Paderborn e. V."]
[36086,"H","Christopher","Zink","BGC Northeim","Ja","","","","","","Bahnen-Golf-Club Northeim e. V."]
[67709,"H","Till","Zipper",{"$f":"VLOOKUP(L3650,Kurznamen,2,0)","v":"TSV Arendsee"},{"$f":"IF(VLOOKUP(L3650,Kurznamen,3,0)=\"Ja\",\"Ja\",\"\")","v":""},"","","","","","Turn- und Sportverein Arendsee e. V. Abteilung Minigolf"]
[35900,"D","Bianca","Zirkenbach","MGC Bad Homburg","","","","","","","Minigolf-Club Bad Homburg e. V."]
[65132,"Jw","Lavinia","Zirkenbach","MGC Bad Homburg","","","","","","","Minigolf-Club Bad Homburg e. V."]
[67492,"Schm","Marlin","Zirkenbach","MGC Bad Homburg","","","","","","","Minigolf-Club Bad Homburg e. V."]
[67569,"Schw","Kiara","Zirkenbach","MGC Bad Homburg","","","","","","","Minigolf-Club Bad Homburg e. V."]
[50153,"D","Bianca","Zodrow-Wenke","MGC Göttingen","Ja","","","","","","1. Miniatur-Golfsport-Club 1970 Göttingen e. V."]
[3510,"Sw 2","Sieglinde","Zollinger","MGF Hilzingen","","","","","","","Minigolffreunde Hilzingen 80 e. V."]
[32674,"H","Lars","Zornstein","CGC Hamm","","","","","","","Cobigolf-Verein Hamm 2019 e. V."]
[36168,"D","Nicole","Zornstein","CGC Hamm","","","","","","","Cobigolf-Verein Hamm 2019 e. V."]
[36914,"Sm 2","Ronald","Zoschke","MGF Magdeburg","","","","","","","Minigolffreunde Magdeburg e. V."]
[38006,"D","Hannah","Zschäpe","VfB Osnabrück","","","","","","","Verein für Bahnengolf Osnabrück von 1984 e. V."]
[37751,"Sm 2","Jens-Bob","Zschäpe","VfB Osnabrück","","","","","","","Verein für Bahnengolf Osnabrück von 1984 e. V."]
[25152,"Sm 2","Jörg","Zseby","VfM Berlin","","","","","","","Verein für Minigolf e. V. Berlin"]
[67723,"Sm 2","Josef","Zwick","MGC Ravensburg","","","","","","","MGC Ravensburg-Weingarten e. V."]
[37389,"D","Michaela","Zwirlein","TG Höchberg","","","","","","","Turngemeinde Höchberg von 1862 Bahnengolf e. V."]
[37390,"Sm 1","Rainer","Zwirlein","MGC Murnau","","","","","","","Minigolfclub Murnau am Staffelsee e. V."]

{"sheet":"Kurznamen","index":8,"n_rows":215,"n_cols":3,"rows_kept":215,"cut":false,"hidden":false,"merged":[]}
["Name aus DMV-Datenbank","Kurzname","MVBN"]
[" Miniaturgolf-Club Ingolstadt e. V.","MGC Ingolstadt"]
["1. Bahnen - Golf - Club Wolfsburg e. V.","BGC Wolfsburg","Ja"]
["1. Bahnen Golf Club Leipzig e. V.","BGC Leipzig"]
["1. Bahnengolfclub Bad Füssing e. V.","BGC Bad Füssing"]
["1. Bahnen-Golf-Club Celle von 1964 e. V.","BGC Celle","Ja"]
["1. Bahnengolfclub Garmisch-Partenkirchen e. V.","BGC Garmisch"]
["1. Bahnen-Golf-Club Hannover e. V.","BGC Hannover","Ja"]
["1. Bahnengolf-Club Landshut e. V.","BGC Landshut"]
["1. Bahnengolfclub Paderborn e. V.","BGC Paderborn"]
["1. Bahnengolf-Club Singen e. V.","BGC Singen"]
["1. Bahnen-Golf-Club Wesseling 1975 e. V. ","BGC Weseling"]
["1. Bahnengolfverein Rodalben 1977 e. V.","BGV Rodalben"]
["1. Berliner Miniaturgolf-Sportclub e. V. 1960","Berliner MSC"]
["1. Cobigolf Club Rot-Weiß Groß-Umstadt e. V.","CGC Groß-Umstadt"]
["1. Duisburger Minigolf Club 1962 e. V.","Duisburger MC"]
["1. Essener cobiGOLF - Club \"Blau-Gold\" e. V.","Essener CGC"]
["1. Fränkischer Minigolfclub Lichtenfels 1961 e. V.","FMGC Lichtenfels"]
["1. Kleingolf Club Homburg-Saar 1967 e. V.","KC Homburg"]
["1. Klein-Golf-Club Mönchengladbach e. V.","KGC Mönchengladbach"]
["1. Miniaturgolf Club Metzingen e. V.","MGC Metzingen"]
["1. Miniaturgolf-Club Ladenburg e. V.","MGC Ladenburg"]
["1. Miniatur-Golf-Club Ludwigshafen 1964 e. V.","MGC Ludwigshafen"]
["1. Miniatur-Golf-Club Mannheim 1968 e. V.","MGC Mannheim"]
["1. Miniaturgolfclub München-Feldmoching e. V.","MGC München"]
["1. Miniaturgolf-Club Peine von 1965 e. V.","MGC Peine","Ja"]
["1. Miniaturgolfclub Süßen e. V.","MGC Süßen"]
["1. Miniaturgolf-Club Weinheim e. V.","MC Weinheim"]
["1. Miniatur-Golfsport-Club 1970 Göttingen e. V.","MGC Göttingen","Ja"]
["1. Miniatur-Golfsport-Club Lohfelden e. V.","MGC Lohfelden","Ja"]
["1. Minigolf Club Gelsenkirchen e. V.","MC Gelsenkirchen"]
["1. Minigolfclub Bamberg e. V.","MGC Bamberg"]
["1. Minigolfclub Epe 1978 e. V.","MGC Epe"]
["1. Minigolfclub Hechingen e. V.","MGC Hechingen"]
["1. Minigolf-Club Köln 1961 e. V.","MGC Köln"]
["1. Minigolf-Club Paderborn 1980 e. V.","MGC Paderborn"]
["1. Minigolf-Club Rheinhausen e. V.","MC Rheinhausen"]
["1. Minigolf-Club Saar 68 St. Ingbert e. V.","MGC St. Ingbert"]
["1. Minigolf-Sport-Club Hamburg-Neu-Wulmstorf e. V.","MSC Neu-Wulstorf"]
["1. Mini-Golfsport-Club Kassel-Vellmar 1964 e. V.","MGC Kassel","Ja"]
["1. Minigolf-Sportclub Wesel 66 66 e. V. ","MSC Wesel"]
["1. Minigolf-Sportverein Netphen e. V.","MSV Netphen"]
["1. Münchener Minigolf-Club 1962 e. V.","Münchener MC"]
["1. Niederbayerischer Minigolf-Club Kelheim e. V.","NMC Kelheim"]
["1. Porzer Minigolfclub Grün-Weiß 1969 e. V.","Porzer MGC"]
["Allgemeiner Sportverein Pegnitz e. V. Abteilung Minigolf","ASV Pegnitz"]
["Bahnengolf - Club Assindia Essen e. V.","BGC Essen"]
["Bahnengolf Club Heilbronn e. V.","BGC Heilbronn"]
["Bahnengolf Club Schloß Paffendorf e. V.","BGC Paffendorf"]
["Bahnengolf Interessen-Gemeinschaft Ingelfingen 2020 e. V.","BIG Ingelfingen"]
["Bahnen-Golf-Club Bad Mergentheim e. V.","BGC Bad Mergentheim"]
["Bahnen-Golf-Club Bad Nenndorf e. V.","BGC Bad Nenndorf","Ja"]
["Bahnen-Golf-Club Bildstock e. V.","BGC Bildstock"]
["Bahnen-Golf-Club Bremen e. V.","BGC Bremen","Ja"]
["Bahnen-Golf-Club Diepholz e. V.","BGC Diepholz","Ja"]
["Bahnengolf-Club Dormagen e. V.","BGC Dormagen"]
["Bahnengolf-Club e. V. Bad Berneck","BGC Bad Berneck"]
["Bahnen-Golf-Club Goslar e. V.","BGC Goslar","Ja"]
["Bahnengolfclub Illertissen e. V.","BGC Illertissen"]
["Bahnen-Golf-Club Kiel-West e. V.","BGC Kiel-West"]
["Bahnengolf-Club Neutraubling e. V.","BGC Neutraubling"]
["Bahnen-Golf-Club Northeim e. V.","BGC Northeim","Ja"]
["Bahnengolf-Club Oberhausen e. V.","BGC Oberhausen"]
["Bahnengolfclub Schweinfurt e. V.","BGC Schweinfurt"]
["Bahnengolf-Club Uerdingen e. V.","BGC Uerdingen"]
["Bahnengolf-Interessen-Gemeinschaft Asperg e. V. 1982","BIG Asperg"]
["Bahnengolfsportclub \"Gut Schlag\" Gladbeck e. V.","BGSC Gladbeck"]
["Bahnengolf-Sportclub Bochum 1978 e. V.","BGC Bochum"]
["Bahnengolfsportverein 82 Ohlsbach e. V.","BSV Ohlsbach"]
["Bahnengolfsportverein 86 München e. V.","BSV München"]
["Bahnengolf-Sportverein Aßlar 1987 e. V.","BSV Asslar"]
["Bahnengolf-Sportverein Bad Homburg v.d.H. e. V.","BSV Bad Homburg"]
["Bahnengolfsportverein Castrop e. V. 1961","BGSV Castrop"]
["Bahnengolf-Sportverein Inzlingen 1979 e. V.","BSV Inzlingen"]
["Bahnen-Golf-Sport-Vereinigung Kerpen e. V.","BGSV Kerpen"]
["Bahnengolf-Verein Bergisch Land 1962/63 e. V.","BGV Bergisch Land"]
["Bahngolf-Sport-Club Ennepetal e. V.","BSC Ennepetal"]
["BGC 90 Ottobrunn e. V.","BGC Ottobrunn"]
["BGC Rheinau-Freistett e. V.","BGC Rheinau-Freistett"]
["BGS Hardenberg-Pötter e. V.","BGS Hardenberg"]
["BGV Backumer Tal Herten e. V.","BGV Backumer Tal"]
["Biskirchener Bahnen-Golf-Verein e. V.","Biskirchener BGV"]
["Bochumer Minigolf-Club 1960 e. V.","Bochumer MC"]
["BSG Pneumant Fürstenwalde e. V. Abteilung Minigolf","BSG Fürstenwalde"]
["BSV AOK Leipzig e. V.","BSV Leipzig"]
["BV Sennestadt e. V.","BV Sennestadt"]
["Cobigolf-Club \"Grün-Gold\" Bad Hamm e. V.","CGC Bad Hamm"]
["COBI-GOLF-CLUB Blau-Gelb Grötzingen 1968 e. V.","CGC Grötzingen"]
["Cobigolfclub Illertal Kellmünz e. V.","CGC Illertal"]
["Cobigolf-Club Rauschenberg e. V.","CGC Rauschenberg"]
["Cobigolf-Verein Hamm 2019 e. V.","CGC Hamm"]
["Elbhavelland e. V. Abteilung Minigolfsport","Elbhavelland"]
["Erster Mainzer Minigolf-Club e. V. 1964","MGC Mainz"]
["Erster Minigolf - Club Tuttlingen e. V.","MGC Tuttlingen"]
["Freizeit Club Bliesen e. V.","FZC Bliesen"]
["Hamburger Minigolf Club von 1965 e. V.","Hamburger MC"]
["Hobbysport Miniaturgolfclub Büttgen e. V.","HMC Büttgen"]
["Klein-Golf-Club Bad Urach e. V.","KGC Bad Urach"]
["Kleingolfclub Waldstadion e. V. Frankfurt am Main\t","KGC Frankfurt"]
["Kölner Miniatur Golf Club e. V.","Kölner MC"]
["Kultur- und Sportverein Baltrum e. V. Sparte Cobigolf","KSV Baltrum"]
["l. Club der Kleingolf - Freunde Dudweiler e. V.","CKF Dudweiler"]
["Männer-Turn-Verein Seesen von 1862 e. V. Abteilung Bahnengolf","MTV Seesen"]
["MC 62 Lüdenscheid e. V.","MC Lüdenscheid"]
["MGC Homburger Land e. V.","MGC Homburger Land"]
["MGC Millennium Viernheim e. V.","MGC Viernheim"]
["MGC Ravensburg-Weingarten e. V.","MGC Ravensburg"]
["MGV Ansbach e. V.","MGV Ansbach"]
["Mini Golf Club Marl 1960 e. V.","MGC Marl"]
["Miniatur - Golf - Club Heven e. V.","MGC Heven"]
["Miniatur Golf Club Sulzfeld e. V.","MGC Sulzfeld"]
["Miniaturgolf – Club Schwaikheim e. V.","MGC Schwaikheim"]
["Miniaturgolf Club Tigers Künsebeck e. V.","MC Künsebeck"]
["Miniaturgolf Sportclub Schriesheim e. V.","MC Schriesheim"]
["Miniaturgolf-Club \"Möve\" Cuxhaven-Sahlenburg e. V.","MC Möve Cuxhaven","Ja"]
["Miniatur-Golf-Club \"Stahlquelle\", Bad Bocklet 1989 e. V.","MGC Bad Bocklet"]
["Miniaturgolf-Club 1978 Remseck a.N. e. V.","MGC Remseck"]
["Miniaturgolfclub Bad Bodendorf e. V.","MGC Bad Bodendorf"]
["Miniatur-Golf-Club Bad Hersfeld e. V.","MGC Bad Hersfeld"]
["Miniaturgolfclub Bad Oldesloe von 1964 e. V.","MGC Bad Oldesloe"]
["Miniaturgolfclub Bad Soden-Salmünster e. V.","MGC Bad Soden"]
["Miniaturgolf-Club Brunsbüttel e. V.","MGC Brunsbüttel"]
["Miniatur-Golf-Club Einbeck e. V.","MGC Einbeck","Ja"]
["Miniatur-Golf-Club Freizeitzentrum Biebertal e. V.","MGC Biebertal"]
["Miniaturgolfclub Friedrichshafen e. V.","MGC Friedrichshafen"]
["Miniatur-Golf-Club Heringen e. V.","MGC Heringen"]
["Miniaturgolf-Club Ilvesheim e. V.","MC Ilvesheim"]
["Miniaturgolfclub Neuwied e. V.","MC Neuwied"]
["Miniatur-Golfclub Oberkochen 1972 e. V.","MGC Oberkochen"]
["Miniaturgolfclub Olympia Kiel e. V.","MGC Olympia Kiel"]
["Miniaturgolfclub Ostheim/Rhön e. V. ","MGC Ostheim/Rhön"]
["Miniaturgolfclub Veitshöchheim e. V.","MGC Veitshöchheim"]
["Miniatur-Golf-Club Wetzlar e. V.","MGC Wetzlar"]
["Miniaturgolf-Club Wolnzach e. V.","MGC Wolnzach"]
["Miniaturgolfsportverein Würzburg - Löwenbrücke e. V.","MGC Würzburg"]
["Miniatur-Golf-Verein Bremen e. V.","MGV Bremen","Ja"]
["Miniaturgolfverein Eibenstock 1997 e. V.\t","MGV Eibenstock"]
["Minigolf Sport-Verein Bad Münder/Springe von 2005 e. V.","MSV Bad Münder/Springe","Ja"]
["Minigolfclub \"AS\" Witten 1963 e. V.","MGC Witten"]
["Minigolfclub Bad Feilnbach e. V.","MGC Bad Feilnbach"]
["Minigolf-Club Bad Homburg e. V.","MGC Bad Homburg"]
["Minigolf-Club Bad Salzuflen e. V.","MGC Bad Salzuflen"]
["Minigolf-Club Bad Waldsee 1990 e. V.","MGC Bad Waldsee"]
["Minigolf-Club Bergisch Gladbach Gierath e. V.","MGC Bergisch Gladbach"]
["Minigolf-Club Diessen e. V.","MGC Diessen"]
["Minigolfclub Dormagen - Brechten e. V.","MGC Dormagen-Brechten"]
["Minigolf-Club Flora Elmshorn e. V.","MC Elmshorn"]
["Minigolf-Club Georgsmarienhütte e. V.","MGC Georgsmarienhütte"]
["Minigolfclub Karlshagen e. V.","MGC Karlshagen"]
["Minigolfclub Monrepos e. V.","MGC Monrepos"]
["Minigolfclub Murnau am Staffelsee e. V.","MGC Murnau"]
["Minigolf-Club Nümbrecht e. V. ","MGC Nümbrecht"]
["Minigolfclub putter Künzell 1970 e. V.","MGC putter Künzell"]
["Minigolfclub Rot-Weiß Wanne-Eickel e. V.","MGC Wanne-Eickel"]
["Minigolfclub Traben-Trarbach e. V.","MGC Traben-Trarbach"]
["Minigolfclub Unterschneidheim e. V.","MGC Unterschneidheim"]
["Minigolf-Club-Felderbachtal 1964 e. V.","MGC Felderbachtal"]
["Minigolfdub Wertheim ´91 e. V.","MGC Wertheim"]
["Minigolffreunde Hammer e. V.","MGF Hammer"]
["Minigolffreunde Hilzingen 80 e. V.","MGF Hilzingen"]
["Minigolffreunde Magdeburg e. V.","MGF Magdeburg"]
["Minigolf-Freunde Steinbruch Kempten e. V.","MGF Kempten"]
["Minigolffreunde Waldshut 1974 e. V.","MGF Waldshut"]
["Minigolf-Sport-Club Bad Godesberg e. V.","MSC Bad Godesberg"]
["Minigolf-Sport-Club Bensheim-Auerbach e. V.","MSC Bensheim-Auerbach"]
["Minigolf-Sport-Club blau-weiß 2003 e. V. München","MSC München"]
["Minigolf-Sportclub Herscheid 1963 e. V.","MSC Herscheid"]
["Minigolfsportfreunde Brilon e. V.","MSF Brilon"]
["Minigolf-Sport-Gemeinschaft Kempten e. V.","MSG Kempten"]
["MINIGOLF-SPORT-KLUB Neheim-Hüsten e. V.","MSK Neheim-Hüsten"]
["MiniGolfSportverein Hildesheim e. V.","MGS Hildesheim","Ja"]
["Minigolfunion Neviges-Odenthal 1968 e. V.","MGU Neviges"]
["MSV Bad Kreuznach e. V.","MSV Bad Kreuznach"]
["MV Lankwitzer Dragons e. V.","MV Lankwitzer Dragons"]
["Niendorfer Miniaturgolf-Club von 1963 e. V.","NDE Miniaturgolf"]
["Oberbayerische Minigolf-Club Ingolstadt e. V.","OMGC Imgolstadt"]
["Olchinger Minigolf Sport Klub e. V.","MSK Olching"]
["Osnabrücker Minigolf Club von 1963 e. V.","Osnabrücker MC"]
["Post- und Telekom-Sportverein Hof e. V. Abteilung Minigolf ","PTSV Hof"]
["Preetzer Turn- und Sportverein von 1861 e. V. Abteilung Minigolf","Preetzer TSV"]
["Rad- und Kraftfahrervereins \"Solidarität\" Mörsch e. V. Abteilung Minigolf Wölfe Rheinstetten 02","RKV Rheinstetten"]
["Reinickendorfer Miniatur - Golfsport - Club e. V.","Reinickendorfer MGC"]
["Rot-Weiß Syburg 1960 e. V.","Rot-Weiß Syburg"]
["SC Bastion Rot - Weiß Lippstadt 1964 e. V.","SC Bastion Lippstadt"]
["Schwimm- und Sportverein Ulm 1846 e. V. Abteilung Bahnengolf","SSV Ulm"]
["SC-Wermelskirchen e. V.","SC Wermelskirchen"]
["Sportclub Bad Münder e. V. Abteilung Bahnengolf","SC Bad Münder","Ja"]
["Sportclub Gut Heil Neumünster von 1881 e. V. Abteilung Miniaturgolf","SC Neumünster"]
["Sport-Club Olympia Dortmund e. V. ","SC Dortmund"]
["Sportgemeinde 1886 e. V. Weiterstadt Abteilung Bahnengolf","SG Weiterstadt"]
["Sportgemeinschaft Arheilgen 1876/1945 e. V. Abteilung Bahnengolf","SG Arheilgen"]
["Sportverein 1890 e. V. Dreieichenhain Abteilung Bahnengolf","SV Dreieichenhain"]
["Sportverein Lurup-Hamburg von 1923 e. V. Abteilung Bahnengolf","SV Lurup"]
["Sportverein Minigolfclub Harrislee-Wassersleben e. V.","MGC Harrislee"]
["SSC Halver e. V.","SSC Halver"]
["Sterngolfclub Glocke Castrop e. V.","SGC Castrop"]
["Sterngolf-Club Hagen e. V.","SGC Hagen"]
["Sterngolf-Sport-Club Attendorn e. V.","SSC Attendorn"]
["SV Glück Auf 1901 Gebhardshagen e. V. Abteilung Minigolf","SV Gebhardshagen","Ja"]
["Tempelhofer Miniaturgolf Verein von 1965 e. V.","Tempelhofer MV"]
["TSV Pfungstadt e. V. Abteilung Bahnengolf","TSV Pfungstadt"]
["Turn - und Sportverein Kücknitz von 1911 e. V. Abteilung Bahnengolf","TSV Kücknitz"]
["Turn- und Sportverein Arendsee e. V. Abteilung Minigolf","TSV Arendsee"]
["Turn- und Sportverein Flöha 1848 e. V. Abteilung Minigolf","TSV Flöha"]
["Turn- und Sportverein Salzgitter e. V. Abteilung Bahnengolf","TSV Salzgitter","Ja"]
["Turngemeinde Höchberg von 1862 Bahnengolf e. V.","TG Höchberg"]
["Turnverein 1901 e. V. Nierstein/Rhein Abteilung Minigolf","TV Nierstein"]
["Turnverein Niederstetten 1862 e. V. Abteilung Minigolf","TV Niederstetten"]
["Turnverein Trappenkamp e. V. Sparte Minigolf","TV Trappenkamp"]
["Verein für Bahnengolf Osnabrück von 1984 e. V.","VfB Osnabrück"]
["Verein für Leibesübungen Lohbrügge von 1892 e. V. Abteilung Bahnengolf","VfL Lohbrügge"]
["Verein für Leibesübungen Lüneburg e. V. Abteilung Bahnengolf","VfL Lüneburg","Ja"]
["Verein für Minigolf Bottrop e. V.","VfM Bottrop"]
["Verein für Minigolf e. V. Berlin","VfM Berlin"]
["VfB 21 Neugattersleben e. V.","VfB Neugattersleben"]